*HEADING
 1D transient wave propagation, acoustic medium, incident wave load, planar
 and defined through pressure amplitude
**
** C = root (K/rho)= 343.05 m/s   K=bulk mod, rho=density.
**
** Analytical solution to prescribed constant acceleration of a0 at x=0
**
** p(x,t) = (K a0 / c^2) (ct - x)  for x < ct
**        = 0  			   for x > ct
**
*PREPRINT,ECHO=NO,HISTORY=NO,MODEL=YES
*NODE, NSET=ODB_NSET
*NGEN,NSET=CHANNEL
*NSET,NSET=SAMPLE,GENERATE
*ELEMENT,TYPE=AC3D8
*ELGEN,ELSET=CHANNEL
**************************
*SURFACE,NAME=IW_LOAD
1,S6
**************************
*SOLID SECTION,MATERIAL=AIR,ELSET=CHANNEL
**
*MATERIAL,NAME=AIR
*DENSITY
 1.21,
*ACOUSTIC MEDIUM,BULK MODULUS
**
**************************
*INCIDENT WAVE PROPERTY,NAME=IWPROP,TYPE=PLANE
*INCIDENT WAVE FLUID PROPERTY
*AMPLITUDE,DEFINITION=TABULAR,NAME=PRESSUREVTIME
0.0,0.0,1.0,-1.0
**************************
*RESTART,WRITE
**
*STEP,INC=1000
*DYNAMIC
.0001,.0044
** DEFINE NONREFLECTIVE BOUNDARY AT X=1
*IMPEDANCE
 100,I4
**
*INCIDENT WAVE,PRESSUREAMPLITUDE=PRESSUREVTIME,PROPERTY=IWPROP
IW_LOAD,415.09517
**
*EL PRINT,FREQ=0
*NODE PRINT,NSET=SAMPLE,FREQ=22
 POR,
*OUTPUT,FIELD,FREQUENCY=1
*NODE OUTPUT
 POR,
*OUTPUT,HISTORY,FREQUENCY=1
*NODE OUTPUT,NSET=SAMPLE
 POR,
*ENDSTEP