*HEADING
 1D transient wave propagation, acoustic medium, incident wave load, planar
 and defined through acceleration amplitude
**
** C = root (K/rho)= 343.05 m/s   K=bulk mod, rho=density.
**
** Analytical solution to prescribed constant acceleration of a0 at x=0
**
** p(x,t) = (K a0 / c^2) (ct - x)  for x < ct
**        = 0  			   for x > ct
**
*PREPRINT,ECHO=NO,HISTORY=NO,MODEL=YES
*NODE, NSET=ODB_NSET
*NGEN,NSET=CHANNEL
*NSET,NSET=SAMPLE,GENERATE
*ELEMENT,TYPE=AC2D4R
*ELGEN,ELSET=CHANNEL
**************************
*SURFACE,NAME=IW_LOAD
1,S4
**************************
** CROSS-SECTION IS 1.E-4
*SOLID SECTION,MATERIAL=AIR,ELSET=CHANNEL
 1.E-2,
**
*MATERIAL,NAME=AIR
*DENSITY
 1.21,
*ACOUSTIC MEDIUM,BULK MODULUS
**
**************************
*INCIDENT WAVE PROPERTY,NAME=IWPROP,TYPE=PLANE
*INCIDENT WAVE FLUID PROPERTY
*AMPLITUDE,DEFINITION=TABULAR,NAME=ACCVTIME
0.0,-1.0,1.0,-1.0
**************************
*RESTART,WRITE
**
*STEP
*DYNAMIC,EXPLICIT
 ,.0044,
** DEFINE NONREFLECTIVE BOUNDARY AT X=1
*IMPEDANCE
 100,I2
**
*INCIDENT WAVE,ACCELERATIONAMPLITUDE=ACCVTIME,PROPERTY=IWPROP
IW_LOAD,1
**
*NSET,NSET=QA_TEST
ODB_NSET,
*OUTPUT,FIELD,NUMBER INTERVAL=2
*NODE OUTPUT
 POR,
*NODE OUTPUT,NSET=QA_TEST
 POR,
*OUTPUT,HISTORY,TIME INTERVAL=0.1E-3
*NODE OUTPUT,NSET=SAMPLE
 POR,
*ENDSTEP