*HEADING
CIRCULAR LOAD ON HALF SPACE, RECT F E MESH, CAX8R,
*NODE
*NGEN,NSET=X0
*NGEN,NSET=X10
*NGEN
*NFILL
X0,X10,8
*NSET,NSET=LHS,GENERATE
*NSET,NSET=RHS,GENERATE
*NSET,NSET=BOT,GENERATE
*NSET,NSET=TOP,GENERATE
*ELEMENT,TYPE=CAX8R,ELSET=ALL
*ELGEN,ELSET=ALL
*SOLID SECTION,ELSET=ALL,MATERIAL=ONE
*MATERIAL,NAME=ONE
*ELASTIC
1.E5,.3
*BOUNDARY
LHS,1
RHS,1
BOT,2
*STEP
*STATIC
*DLOAD
1,P3,100.
2,P3,100.
*NODE FILE,NSET=TOP
U,
*END STEP