*Heading
** Job name: heatTransfer2D Model name: Model-1
** Generated by: Abaqus/CAE 6.9-EFR
*Preprint, echo=NO, model=NO, history=NO, contact=NO
**
** PARTS
**
*Part, name=Part-1
*End Part
**
**
** ASSEMBLY
**
*Assembly, name=Assembly
**
*Instance, name=Part-1-1, part=Part-1
*Node
*Element, type=DC2D3
*Nset, nset=_PickedSet2, internal, generate
*Elset, elset=_PickedSet2, internal, generate
*Nset, nset=AllNodes, generate
*Elset, elset=AllNodes, generate
*Nset, nset=Edge
*Elset, elset=Edge
** Section: Section-1
*Solid Section, elset=_PickedSet2, material=Material-1
*End Instance
**
*Instance, name=Part-1-1-lin-2-1, part=Part-1
*Node
*Element, type=DC2D4
*Nset, nset=_PickedSet2, internal, generate
*Elset, elset=_PickedSet2, internal, generate
*Nset, nset=AllNodes, generate
*Elset, elset=AllNodes, generate
*Nset, nset=Edge
*Elset, elset=Edge
** Section: Section-1
*Solid Section, elset=_PickedSet2, material=Material-1
*End Instance
**
*Instance, name=Part-1-1-lin-3-1, part=Part-1
*Node
*Element, type=DC2D4
*Nset, nset=_PickedSet2, internal, generate
*Elset, elset=_PickedSet2, internal, generate
*Nset, nset=AllNodes, generate
*Elset, elset=AllNodes, generate
*Nset, nset=Edge
*Elset, elset=Edge
** Section: Section-1
*Solid Section, elset=_PickedSet2, material=Material-1
*End Instance
**
*Instance, name=Part-1-1-lin-4-1, part=Part-1
*Node
*Element, type=DC2D6
*Nset, nset=_PickedSet2, internal, generate
*Elset, elset=_PickedSet2, internal, generate
*Nset, nset=AllNodes, generate
*Elset, elset=AllNodes, generate
*Nset, nset=Edge
*Elset, elset=Edge
** Section: Section-1
*Solid Section, elset=_PickedSet2, material=Material-1
*End Instance
**
*Instance, name=Part-1-1-lin-5-1, part=Part-1
*Node
*Element, type=DC2D6
*Nset, nset=_PickedSet2, internal, generate
*Elset, elset=_PickedSet2, internal, generate
*Nset, nset=AllNodes, generate
*Elset, elset=AllNodes, generate
*Nset, nset=Edge
*Elset, elset=Edge
** Section: Section-1
*Solid Section, elset=_PickedSet2, material=Material-1
*End Instance
**
*Instance, name=Part-1-1-lin-6-1, part=Part-1
*Node
*Element, type=DC2D8
*Nset, nset=_PickedSet2, internal, generate
*Elset, elset=_PickedSet2, internal, generate
*Nset, nset=AllNodes, generate
*Elset, elset=AllNodes, generate
*Nset, nset=Edge
*Elset, elset=Edge
** Section: Section-1
*Solid Section, elset=_PickedSet2, material=Material-1
*End Instance
**
*Instance, name=Part-1-1-lin-7-1, part=Part-1
*Node
*Element, type=DC2D8
*Nset, nset=_PickedSet2, internal, generate
*Elset, elset=_PickedSet2, internal, generate
*Nset, nset=AllNodes, generate
*Elset, elset=AllNodes, generate
*Nset, nset=Edge
*Elset, elset=Edge
** Section: Section-1
*Solid Section, elset=_PickedSet2, material=Material-1
*End Instance
**
*Nset, nset=_PickedSet20, internal, instance=Part-1-1, generate
*Nset, nset=_PickedSet20, internal, instance=Part-1-1-lin-2-1, generate
*Nset, nset=_PickedSet20, internal, instance=Part-1-1-lin-4-1, generate
*Nset, nset=_PickedSet20, internal, instance=Part-1-1-lin-6-1, generate
*Nset, nset=_PickedSet20, internal, instance=Part-1-1-lin-3-1, generate
*Nset, nset=_PickedSet20, internal, instance=Part-1-1-lin-5-1, generate
*Nset, nset=_PickedSet20, internal, instance=Part-1-1-lin-7-1, generate
*Elset, elset=_PickedSet20, internal, instance=Part-1-1, generate
*Elset, elset=_PickedSet20, internal, instance=Part-1-1-lin-2-1, generate
*Elset, elset=_PickedSet20, internal, instance=Part-1-1-lin-4-1, generate
*Elset, elset=_PickedSet20, internal, instance=Part-1-1-lin-6-1, generate
*Elset, elset=_PickedSet20, internal, instance=Part-1-1-lin-3-1, generate
*Elset, elset=_PickedSet20, internal, instance=Part-1-1-lin-5-1, generate
*Elset, elset=_PickedSet20, internal, instance=Part-1-1-lin-7-1, generate
*End Assembly
**
** MATERIALS
**
*Material, name=Material-1
*Conductivity
 60.5,
*Density
7854.,
*Specific Heat
434.,
*Initial Conditions, Type=Temperature
 _PickedSet20, 10.
** ----------------------------------------------------------------
**
** STEP: Step-1
**
*Step, name=Step-1
Heat Transfer
*Heat Transfer, steady state
0.2, 1., 0.2, 0.2,
**
** BOUNDARY CONDITIONS
**
** Name: BC-1 Type: Temperature
*Boundary, user
_PickedSet20, 11, 11, 1.
**
** OUTPUT REQUESTS
**
*Restart, write, frequency=0
**
** FIELD OUTPUT: F-Output-1
**
*Output, field
*Node Output
NT,
*Output, history, frequency=0
*End Step