*Heading
 Basic Verification Of Field Dependence Of Conductivity
 Test Type: Material Verification  [dc2d8]
**
** See "Thermal Properties"  Of Abaqus/Verification
** Manual -- Chapter 2.3.1
**
*Node,Nset=Nall
*Nset,Nset=Fvnods
*Nset,Nset=Hfvnods
*Nset,Nset=Left
*Nset,Nset=Right
*Element,Elset=K1k3,Type=dc2d8
*Element,Elset=K2fv,Type=dc2d8
*Solid Section,Elset=K1k3,Material=Kconst
 3.,
*Solid Section,Elset=K2fv,Material=Kfvdep
 3.,
*Initial Conditions,Type=Temperature
 Nall,0.
*Initial Conditions,Type=Field
 Nall,0.
*Material,Name=Kconst
*Conductivity
 150.,
*Density
 7850.,
*Specific Heat
 460.,
*Material,Name=Kfvdep
*Conductivity,Dep=1
 1.,,25.
 10.,,50.
 100.,,75.
 1000,,100.
*Density
 7850.,
*Specific Heat
 460.,
*Amplitude,Name=Rise
 0.,0.,1.,1.
*Step,Amp=Step
*Heat Transfer, Steady State
 .25,1.,.25,.25
*Boundary
 Left,  11,11,1000.
 Right, 11,11,0.
*Field,Variable=1,Amp=Rise
 Fvnods,100.
 Hfvnods,25.
*Node File
 Nt,
*El File, Position=Centroidal
 Fv,
*El File, Position=Integration Points
 Fv,
*Output, Field
*Node Output
 Nt,
*Element Output, Position=Centroidal
 Fv,
*Element Output, Position=Integration Points
 Fv,
*End Step