*Heading
** Job name: 3d_1 Model name: Model-1
*Preprint, echo=NO, model=NO, history=NO, contact=NO
**
** PARTS
**
*Part, name=Part-1
*End Part
**
**
** ASSEMBLY
**
*Assembly, name=Assembly
**
*Instance, name=Part-1-1, part=Part-1
*Node
*Element, type=C3D8I
** Region: (Section-1:Picked)
*Elset, elset=_PickedSet2, internal, generate
** Section: Section-1
*Solid Section, elset=_PickedSet2, material=Material-1
1.,
*End Instance
**
*Nset, nset=end, instance=Part-1-1, generate
*Elset, elset=end, instance=Part-1-1, generate
*Nset, nset=symm1, instance=Part-1-1, generate
*Elset, elset=symm1, instance=Part-1-1, generate
*Nset, nset=symm-2, instance=Part-1-1, generate
*Elset, elset=symm-2, instance=Part-1-1, generate
*Nset, nset=symm-3, instance=Part-1-1, generate
*Elset, elset=symm-3, instance=Part-1-1, generate
*Nset, nset=symm-4, instance=Part-1-1, generate
*Elset, elset=symm-4, instance=Part-1-1, generate
*Nset, nset=f1, instance=Part-1-1, generate
*Elset, elset=f1, instance=Part-1-1, generate
*Nset, nset=f2, instance=Part-1-1, generate
*Elset, elset=f2, instance=Part-1-1, generate
*Elset, elset=_Cant_t_S6, internal, instance=Part-1-1, generate
*Surface, type=ELEMENT, name=Cant_t
_Cant_t_S6, S6
*Elset, elset=_Cant_b_S4, internal, instance=Part-1-1, generate
*Surface, type=ELEMENT, name=Cant_b
_Cant_b_S4, S4
*Nset, nset=QA_TEST, instance=Part-1-1
*End Assembly
**
** MATERIALS
**
*Material, name=Material-1
*Elastic
 1e+09, 0.3
** ----------------------------------------------------------------
**
** STEP: Step-1
**
*Step, name=Step-1, inc=1000
*Static
1., 7.,
**
** BOUNDARY CONDITIONS
**
** Name: BC-1 Type: Displacement/Rotation
*Boundary
f1, 1, 1
f1, 2, 2
f1, 3, 3
f1, 4, 4
f1, 5, 5
f1, 6, 6
** Name: BC-2 Type: Displacement/Rotation
*Boundary
f2, 1, 1
f2, 3, 3
f2, 4, 4
f2, 5, 5
f2, 6, 6
**
*co-simulation, NAME=cosimulation_name, PROGRAM=MpCCI
*co-simulation region, type=surface, import
Cant_t,cf
Cant_b,cf
*co-simulation region, type=surface, export
Cant_t,coord
Cant_b,coord
**
** OUTPUT REQUESTS
**
*Restart, write, frequency=0
**
** FIELD OUTPUT: F-Output-1
**
*Output, field, freq=100
*node output
U,
CF,
RF,
COORD
*Output, field, freq=100
*node output, nset=QA_TEST
 U,
*End Step