*HEADING
 ** *AQUA and *WIND loading tests for ELBOW31B elements
*NODE,NSET=ALL
*ELEMENT,TYPE=ELBOW31B,ELSET=ALL
*BEAM SECTION,SECTION=ELBOW,MATERIAL=A1, ELSET=ALL
1.0,0.05,0.
5.,0.,10.
5,18,0
*MATERIAL,NAME=A1
*ELASTIC
30.0E9,0.3
**A negligible density is added to allow dynamic steps.
*DENSITY
1.E-1,
*AMPLITUDE, NAME=TEN
0.,10.,  1.,10.
*AMPLITUDE, name= A1_5
0., 1.5, 1., 1.5
*AMPLITUDE,NAME=ZERO
0.,0.,  1.,0.
********************* Node sets for loading and B.C.s
*NSET,NSET=support
 all,
*NSET,nset=twist
*Nset,nset=end1
*nset, nset=end2
*********************
*INCLUDE,INPUT=aqua3delbowbc_loads.inp