*HEADING
: CORIOLIS LOAD  [T3D2]
*PREPRINT,ECHO=YES,HISTORY=NO,MODEL=NO
*NODE,NSET=NALL
*ELEMENT,TYPE=T3D2, ELSET=EALL
*SOLID SECTION,MATERIAL=A1, ELSET=EALL
 .1,
*MATERIAL,NAME=A1
*ELASTIC
 30.E6,
*STEP
*STATIC
.0001,.0001
*BOUNDARY
 NALL,1,1,.001
 NALL,2,2,.0005
*OUTPUT,HISTORY,FREQUENCY=1
*ENERGY OUTPUT,VARIABLE=PRESELECT
*OUTPUT,FIELD
*ELEMENT OUTPUT
LOADS,
*OUTPUT,FIELD
*NODE OUTPUT
RF,
*NODE PRINT
 RF,
*DLOAD
 1,CORIO,5.,0.,0.,0.,0.,0.,1.
*EL PRINT
 LOADS,
*END STEP