*HEADING
: DLOADS AND *TEMPERATURE FOR STRESS-DISPLACEMENT ELEMENTS  [T2D3H]
*PREPRINT,ECHO=YES,HISTORY=NO,MODEL=NO
*NODE,NSET=ALL
*ELEMENT,TYPE=T2D3H, ELSET=EALL
*SOLID SECTION,MATERIAL=A1, ELSET=EALL
.1,
*MATERIAL,NAME=A1
*ELASTIC
3.E6      , .3
*EXPANSION
.0001,
*DENSITY
5.E-5,
*INITIAL CONDITIONS,TYPE=TEMPERATURE
ALL  , -10.
*BOUNDARY
ALL  , 1    , 2
*STEP,PERTURBATION
*STATIC
*OUTPUT,HISTORY,FREQUENCY=1
*ENERGY OUTPUT,VARIABLE=PRESELECT
*OUTPUT,FIELD
*ELEMENT OUTPUT
LOADS,
*OUTPUT,FIELD
*NODE OUTPUT
RF,
*NODE PRINT
 RF,
*DLOAD
1,BX,1000.
*EL PRINT
 LOADS,
*END STEP
*STEP,PERTURBATION
*STATIC
*DLOAD
1,BY,2000.
*END STEP
*STEP,PERTURBATION
*STATIC
*DLOAD
1,CENT,1000.,0.5,0.,0.,0.,1.,0.
*END STEP
*STEP,PERTURBATION
*STATIC
*DLOAD
1,CENTRIF,2.E7,0.5,0.,0.,0.,1.,0.
*END STEP
*STEP,PERTURBATION
*STATIC
*DLOAD
1,GRAV,400.,0.,-1.,0.
*END STEP
*STEP,PERTURBATION
*STATIC
*TEMPERATURE
ALL,40.
*EL PRINT
 S,
*OUTPUT,FIELD
*ELEMENT OUTPUT
S,
*NODE PRINT
 RF,
*OUTPUT,FIELD
*NODE OUTPUT
RF,
*END STEP
*STEP,PERTURBATION
*STATIC
*BOUNDARY,OP=NEW
 1,1,2
*TEMPERATURE
ALL,40.
*NODE PRINT
 U,
*OUTPUT,FIELD
*NODE OUTPUT
U,
*EL PRINT,FREQ=0
*END STEP