*HEADING
: DLOADS *TEMPERATURE FOR STRESS-DISPLACEMENT ELEMENTS  [SAXA12]
*NODE,NSET=NALL
*NSET,NSET=NALL
*ELEMENT,TYPE=SAXA12,OFFSET=10, ELSET=EALL
*SHELL SECTION,MATERIAL=MATPROP, ELSET=EALL
0.01,
*MATERIAL,NAME=MATPROP
*ELASTIC
 30E6,0.3
*BOUNDARY
NALL,1,2
*STEP,PERTURBATION
*STATIC
*DLOAD
1,BX,1500.
*OUTPUT,FIELD
*NODE OUTPUT
RF,
*EL PRINT,FREQ=1
S,
*NODE PRINT,FREQ=1
RF,
*END STEP
*STEP,PERTURBATION
*STATIC
*DLOAD
1,BZ,1500.
*OUTPUT,FIELD
*NODE OUTPUT
RF,
*EL PRINT,FREQ=1
S,
*NODE PRINT,FREQ=1
RF,
*END STEP
*STEP,PERTURBATION
*STATIC
*DLOAD
1,HP,10000.,1.E6,0.
*END STEP
*STEP,PERTURBATION
*STATIC
*DLOAD
1,P,20000.
*END STEP