*HEADING
: DLOADS AND *TEMPERATURE FOR STRESS-DISPLACEMENT ELEMENTS  [S4R]
*PREPRINT,ECHO=YES,HISTORY=NO,MODEL=NO
*NODE,NSET=ALL
*NSET,NSET=LEFT
*NSET,NSET=BOT
*ELEMENT,TYPE=S4R, ELSET=EALL
*SHELL SECTION,MATERIAL=A1, ELSET=EALL
2. ,5
*MATERIAL,NAME=A1
*ELASTIC
3.E6      , 0.3
*EXPANSION
0.0001,
*DENSITY
 1.0,
*INITIAL CONDITIONS,TYPE=TEMPERATURE
ALL, -10.
*BOUNDARY
ALL, 1,5
*STEP,PERTURB
*STATIC
*OUTPUT,HISTORY,FREQUENCY=1
*ENERGY OUTPUT,VARIABLE=PRESELECT
*OUTPUT,FIELD
*NODE OUTPUT
RF,
*DLOAD
1,BX,1000.
*EL PRINT, TOTALS=YES
 LOADS,
 IVOL,
 SVOL,
 EVOL,
*OUTPUT,FIELD
*ELEMENT OUTPUT
LOADS,
IVOL,
SVOL,
EVOL,
*NODE PRINT
 RF,
*END STEP
*STEP,PERTURB
*STATIC
*DLOAD
1,BY,2000.
*END STEP
*STEP,PERTURB
*STATIC
*DLOAD
 1,BZ,3000.
*END STEP
*STEP,PERTURB
*STATIC
*DLOAD
 1,GRAV,3000.,0,0,1.
*END STEP
*STEP,PERTURB
*STATIC
*DLOAD
1,CENT,3000.,0.,0.,0.,0.,1.,0.
*END STEP
*STEP,PERTURB
*STATIC
*DLOAD
1,CENTRIF,3000.,0.,0.,0.,0.,1.,0.
*END STEP
*STEP,PERTURB
*STATIC
*DLOAD
1,HP,3000.,7.,0.
*END STEP
*STEP,PERTURB
*STATIC
*DLOAD
1,P,1000.
*END STEP
*STEP,PERTURBATION
*STATIC
*TEMPERATURE
ALL,40.
*OUTPUT,FIELD
*ELEMENT OUTPUT
S,
*OUTPUT,FIELD
*NODE OUTPUT
RF,
U,
*EL PRINT
 S,
*NODE PRINT
 RF,
 U,
*END STEP
*STEP,PERTURBATION
*STATIC
*BOUNDARY,OP=NEW
ALL,3,6
LEFT,1
BOT,2
*TEMPERATURE,OP=MOD
ALL,40.
*END STEP