*HEADING
: *DSFLUX, *SFILM, AND *SRADIATION FOR HEAT TRANSFER ELEMENTS  [DSAX2]
*NODE, NSET=ALL
*ELEMENT,TYPE=DSAX2, ELSET=EALL
*surface, NAME=TOP
 EALL,SPOS
*surface, NAME=BOT
 EALL,SNEG
*SHELL SECTION, ELSET=EALL, MATERIAL=MAT
 .5, 3
*PHYSICAL CONSTANTS, ABSOLUTE ZERO=-460., STEFAN BOLTZMANN=5.E-08
*MATERIAL,NAME=MAT
*CONDUCTIVITY
 3.77E-5,
*SPECIFIC HEAT
 .39,
*DENSITY
 82.9,
*STEP
*HEAT TRANSFER, STEADY STATE
*NODE PRINT
 NT,RFL
*OUTPUT,FIELD
*NODE OUTPUT
NT,RFL
*EL PRINT,FREQ=0
*OUTPUT,FIELD
*ELEMENT OUTPUT
*DFLUX,OP=NEW
 1, BF, .3
*BOUNDARY,OP=NEW
 ALL, 11
*END STEP
*STEP
*HEAT TRANSFER, STEADY STATE
*DFLUX,OP=NEW
*DSFLUX,OP=NEW
 BOT, S, .3
*BOUNDARY,OP=NEW
 ALL, 13
*END STEP
*STEP
*HEAT TRANSFER, STEADY STATE
*DSFLUX,OP=NEW
 TOP, S, .3
*BOUNDARY,OP=NEW
 ALL, 11
*END STEP
*STEP
*HEAT TRANSFER, STEADY STATE
*DSFLUX,OP=NEW
*SFILM, OP=NEW
 BOT, F, 75., .103
*BOUNDARY,OP=NEW
 ALL, 13
*END STEP
*STEP
*HEAT TRANSFER, STEADY STATE
*SFILM, OP=NEW
 TOP, F, 75., .103
*BOUNDARY,OP=NEW
 ALL, 11
*END STEP
*STEP
*HEAT TRANSFER, STEADY STATE
*SFILM, OP=NEW
*SRADIATE,OP=NEW
 BOT, R, 75., 1.E-06
*BOUNDARY,OP=NEW
 ALL, 13
*END STEP
*STEP
*HEAT TRANSFER, STEADY STATE
*SRADIATE,OP=NEW
 TOP, R, 75., 1.E-06
*BOUNDARY,OP=NEW
 ALL, 11
*END STEP