*HEADING
: RIBBON TEST FOR SHELLS WITH APPLIED MOMENTS  [S9R5]
*PREPRINT,ECHO=YES,HISTORY=NO,MODEL=NO
*NODE
***
*ELEMENT,TYPE=S9R5, ELSET=EALL
*NSET,NSET=CLAMP
*BOUNDARY
CLAMP,1,5
*MATERIAL,NAME=SHELL
*ELASTIC
1E7,0.25
*SHELL SECTION,MAT=SHELL, ELSET=EALL
0.05,
*NSET,NSET=NDISP
*STEP
*STATIC
*CLOAD
2,4, 1.0
3,4, 1.0
12,4, 1.0
13,4, 1.0
22,4, 1.0
23,4, 1.0
32,4, 1.0
33,4, 1.0
*ENERGY FILE
*NODE FILE
 U,
 COORD,
*NODE PRINT
 U,
 COORD,
*EL PRINT,FREQUENCY=0
*OUTPUT,HISTORY,FREQUENCY=1
*NODE OUTPUT,NSET=NDISP
 U,
 COORD,
*END STEP