*HEADING
: CONSTANT CURVATURE TEST FOR SHELLS  [S8R5]
*PREPRINT,ECHO=YES,HISTORY=NO,MODEL=NO
*NODE
*ELEMENT,TYPE=S8R5, ELSET=EALL
*SHELL SECTION,MATERIAL=A1, ELSET=EALL
 1.0,
*MATERIAL,NAME=A1
*ELASTIC,TYPE=ISOTROPIC
 1000.0,0.3
*BOUNDARY
 1,1,3
 2,1,3
 3,1,2
 4,1,3
 5,1,2
 6,1,2
 7,1,2
 8,1,2
*STEP
*STATIC
*CLOAD
 1,4, 20.0
 1,5,-10.0
 4,4,-20.0
 4,5,-10.0
 2,4, 20.0
 2,5, 10.0
 3,4,-20.0
 3,5, 10.0
*OUTPUT,FIELD
*ELEMENT OUTPUT
*OUTPUT,HISTORY,FREQUENCY=1
*ENERGY OUTPUT,VARIABLE=PRESELECT
*OUTPUT,FIELD
*NODE OUTPUT
U,COORD
*NODE PRINT
 U,COORD
*EL PRINT,FREQ=0
*END STEP