*HEADING
This is a test of angular acceleration loading for S8RT elements.
*NODE,NSET=ALL
*ELEMENT,TYPE=S8RT,ELSET=EALL
*SHELL SECTION,MATERIAL=STEEL,ELSET=EALL
1.,3
*MATERIAL,NAME=STEEL
*ELASTIC
30.E6,.33
*DENSITY
2000.,
*CONDUCTIVITY
0.001,
*BOUNDARY
ALL,1,6
*STEP
*STATIC
*DLOAD
EALL,ROTA,10.,0.,0.,0.,0,0,1
*NODE PRINT,TOTALS=YES
RF,
*EL PRINT
EVOL,
*OUTPUT,FIELD
*NODE OUTPUT
RF,
*OUTPUT,FIELD,FREQ=0
*ELEMENT OUTPUT
*END STEP