*Heading
** Job name: err_dc2d4 Model name: Model-1
*Preprint, echo=NO, model=NO, history=NO, contact=NO
**
** PARTS
**
*Part, name=Part-1
*End Part
**
**
** ASSEMBLY
**
*Assembly, name=Assembly
**
*Instance, name=Part-1-1, part=Part-1
*Node
*Element, type=DC2D4
*Nset, nset=_PickedSet2, internal, generate
*Elset, elset=_PickedSet2, internal, generate
** Region: (Section-1:Picked)
*Elset, elset=_PickedSet2, internal, generate
** Section: Section-1
*Solid Section, elset=_PickedSet2, material=Material-1
1.,
*End Instance
**
*Nset, nset=_PickedSet4, internal, instance=Part-1-1, generate
*Elset, elset=_PickedSet4, internal, instance=Part-1-1, generate
*Elset, elset=__PickedSurf5_S2, internal, instance=Part-1-1
*Elset, elset=__PickedSurf5_S3, internal, instance=Part-1-1
*Surface, type=ELEMENT, name=_PickedSurf5, internal
__PickedSurf5_S2, S2
__PickedSurf5_S3, S3
*Elset, elset=__PickedSurf6_S2, internal, instance=Part-1-1
*Elset, elset=__PickedSurf6_S3, internal, instance=Part-1-1, generate
*Surface, type=ELEMENT, name=_PickedSurf6, internal
__PickedSurf6_S2, S2
__PickedSurf6_S3, S3
*End Assembly
**
** MATERIALS
**
*Material, name=Material-1
*Conductivity
3.,
*Density
1.,
*Specific Heat
20.,
**
** PREDEFINED FIELDS
**
** Name: Predefined Field-1   Type: Temperature
*Initial Conditions, type=TEMPERATURE
_PickedSet4, 3.
** ----------------------------------------------------------------
**
** STEP: Step-1
**
*Step, name=Step-1
*Heat Transfer, end=PERIOD, deltmx=2.
1., 20., 0.0002, 20.,
**
** LOADS
**
** Name: Load-1   Type: Surface heat flux
*Dsflux
_PickedSurf5, S, 5.
** Name: Load-2   Type: Surface heat flux
*Dsflux
_PickedSurf6, S, -1.
**
** OUTPUT REQUESTS
**
*Restart, write, frequency=0
**
** FIELD OUTPUT: F-Output-1
**
*Output, field,FREQ=2
*Node Output
NT, RFL
*Element Output, directions=YES
EVOL, HFL, HFLERI, HFLAVG
**
** HISTORY OUTPUT: H-Output-1
**
*Output, history, variable=PRESELECT
*End Step