*Heading
** Job name: err_cpe8rht Model name: Model-1
*Preprint, echo=NO, model=NO, history=NO, contact=NO
**
** PARTS
**
*Part, name=P
*End Part
**
**
** ASSEMBLY
**
*Assembly, name=Assembly
**
*Instance, name=P-1, part=P
*Node
*Element, type=CPE8RHT
*Nset, nset=_PickedSet2, internal, generate
*Elset, elset=_PickedSet2, internal, generate
** Region: (Section-1:Picked)
*Elset, elset=_PickedSet2, internal, generate
** Section: Section-1
*Solid Section, elset=_PickedSet2, material=Material-1
1.,
*End Instance
**
*Nset, nset=_PickedSet4, internal, instance=P-1
*Nset, nset=_PickedSet5, internal, instance=P-1
*Elset, elset=_PickedSet5, internal, instance=P-1, generate
*Nset, nset=_PickedSet6, internal, instance=P-1
*Nset, nset=_PickedSet7, internal, instance=P-1, generate
*Elset, elset=_PickedSet7, internal, instance=P-1, generate
*Elset, elset=__PickedSurf8_S2, internal, instance=P-1
*Surface, type=ELEMENT, name=_PickedSurf8, internal
__PickedSurf8_S2, S2
*End Assembly
**
** MATERIALS
**
*Material, name=Material-1
*Conductivity
20.,
*Density
1.,
*Elastic
10000., 0.3
*Plastic
120.,   0.
300., 0.01
*Specific Heat
2.,
**
** PREDEFINED FIELDS
**
** Name: Predefined Field-1   Type: Temperature
*Initial Conditions, type=TEMPERATURE
_PickedSet7, 5.
** ----------------------------------------------------------------
**
** STEP: Step-1
**
*Step, name=Step-1, nlgeom=YES
*Coupled Temperature-Displacement, creep=none, deltmx=3.
1., 30., 0.0003, 30.
**
** BOUNDARY CONDITIONS
**
** Name: BC-1 Type: Displacement/Rotation
*Boundary
_PickedSet5, 1, 1
_PickedSet5, 2, 2
_PickedSet5, 6, 6
**
** LOADS
**
** Name: Load-1   Type: Concentrated force
*Cload
_PickedSet4, 2, -100.
** Name: Load-2   Type: Concentrated heat flux
*Cflux
_PickedSet6, 11, 20.
** Name: Load-3   Type: Surface heat flux
*Dsflux
_PickedSurf8, S, 5.
**
** OUTPUT REQUESTS
**
*Restart, write, frequency=0
**
** FIELD OUTPUT: F-Output-1
**
*Output, field
*Node Output
NT, RFL, U
*Element Output, directions=YES
ENDENERI, ENDEN, HFL, HFLERI, HFLAVG, LE, MISESERI, MISESAVG, PE, PEEQ, PEEQERI, PEEQAVG, PEERI, PEAVG, S
**
** HISTORY OUTPUT: H-Output-1
**
*Output, history, variable=PRESELECT
*End Step