*HEADING
: SHEAR FLEXIBLE BEAMS AND SHELLS - II  [PIPE21]
*NODE
*ELEMENT,TYPE=PIPE21, ELSET=EALL
*BEAM SECTION, SECTION=PIPE,MATERIAL=A1, ELSET=EALL
 0.5, 0.05
 0.0, 0.0, -1.0
*MATERIAL,NAME=A1
*ELASTIC,TYPE=ISOTROPIC
 30.0E6,0.3
*BOUNDARY
 1,6
 2,1,2
*STEP,PERTURBATION
*STATIC
*CLOAD
 2,6, 100.0
*OUTPUT,FIELD
*ELEMENT OUTPUT
SF,
*EL PRINT
 SF,
*OUTPUT,FIELD
*NODE OUTPUT
U,COORD
*NODE PRINT
 U,COORD
*END STEP