*HEADING
: DLOADS AND *TEMPERATURE FOR STRESS-DISPLACEMENT ELEMENTS  [PIPE21]
*NODE,NSET=NALL
*INITIAL CONDITIONS, TYPE=TEMPERATURE
 NALL, -10., -10., -10.
*ELEMENT,TYPE=PIPE21, ELSET=EALL
*BEAM SECTION,SECTION=PIPE, TEMPERATURE=VALUES,MATERIAL=A1, ELSET=EALL
 2.,0.2
*MATERIAL,NAME=A1
*ELASTIC
 3.E6,.3
*EXPANSION
 0.0001,
*DENSITY
 0.4188,
*BOUNDARY
 NALL,1,2
 NALL,6
*STEP,PERTURBATION
*STATIC
*LOAD CASE, NAME=CENT
*DLOAD
 1, CENT, 3000., 7.5, 0., 0.,  0., 0., 1.
*END LOAD CASE
*LOAD CASE, NAME=CENTRIF
*DLOAD
1,CENTRIF,3000.,7.5,0.,0.,0.,0.,1.
*END LOAD CASE
*LOAD CASE, NAME=DIST
*DLOAD
 1, P2, 1000.
*END LOAD CASE
*EL PRINT, TOTALS=YES
 LOADS,
 IVOL,
 SVOL,
 EVOL,
*NODE PRINT
 RF,
*OUTPUT,FIELD
*ELEMENT OUTPUT
IVOL, SVOL, EVOL
*NODE OUTPUT
RF,
*END STEP
*STEP,PERTURBATION
*STATIC
*LOAD CASE,NAME=PIOPEN
*DLOAD
1,PI,500.,3.6,OPEN
*END LOAD CASE
*LOAD CASE, NAME=PICLOSED
*DLOAD
1,PI,500.,3.6,CLOSED
*END LOAD CASE
*LOAD CASE, NAME=PEOPEN
*DLOAD
1,PE,500.,4.0,OPEN
*END LOAD CASE
*LOAD CASE, NAME=PECLOSED
*DLOAD
1,PE,500.,4.0,CLOSED
*END LOAD CASE
*LOAD CASE, NAME=HPIOPEN
*DLOAD
1,HPI,115.2,100.,0.,3.6,OPEN
*END LOAD CASE
*LOAD CASE, NAME=HPICLOSED
*DLOAD
1,HPI,115.2,100.,0.,3.6,CLOSED
*END LOAD CASE
*LOAD CASE, NAME=HPEOPEN
*DLOAD
1,HPE,6400.,100.,0.,4.0,OPEN
*END LOAD CASE
*LOAD CASE, NAME=HPECLOSED
*DLOAD
1,HPE,6400.,100.,0.,4.0,CLOSED
*END LOAD CASE
*EL PRINT
 LOADS,
 S,
SF1,ESF1
*NODE PRINT
 RF,
*OUTPUT,FIELD
*ELEMENT OUTPUT
 S,SF,ESF1
*NODE OUTPUT
RF,
*END STEP
*STEP,PERTURBATION
*STATIC
*LOAD CASE, NAME=PX
*DLOAD
 1, PX, 1000.
*END LOAD CASE
*LOAD CASE, NAME=PY
*DLOAD
 1, PY, 2000.
*END LOAD CASE
*LOAD CASE, NAME=GRAV
*DLOAD
 1, GRAV, 2000.,  0., 1., 0.
*END LOAD CASE
*EL PRINT
 LOADS,
*NODE PRINT
 RF,
*OUTPUT,FIELD
*NODE OUTPUT
RF,
*END STEP
*STEP
*STATIC
 .00001,.00001
*BOUNDARY,OP=NEW
 NALL,1,1,.0001
 NALL,2,2,.00005
 NALL,6
*DLOAD
 1,CORIO,5.,0.,0.,0.,0.,0.,1.
*EL PRINT, TOTALS=YES
 LOADS,
 IVOL,
 SVOL,
 EVOL,
*NODE PRINT
 RF,
*OUTPUT,FIELD
*NODE OUTPUT
RF,
*ELEMENT OUTPUT
 IVOL,SVOL,EVOL
*OUTPUT,HISTORY
*ENERGY OUTPUT,VARIABLE=ALL
*ELEMENT OUTPUT,ELSET=EALL
 IVOL,SVOL,EVOL
*NODE OUTPUT,NSET=NALL
RF,
*END STEP
*STEP
*STATIC
*BOUNDARY,OP=NEW
 NALL,1,2
 NALL,6
*DLOAD,OP=NEW
*TEMPERATURE,OP=NEW
 NALL, 10., 20., 30.
*EL PRINT
 S,
 E,
 EE,
*NODE PRINT
 RF,
*OUTPUT,FIELD
*NODE OUTPUT
RF,
*ELEMENT OUTPUT
 S,E,EE
*OUTPUT,HISTORY
*ENERGY OUTPUT,VARIABLE=ALL
*ELEMENT OUTPUT,ELSET=EALL
 S,E,EE
*NODE OUTPUT,NSET=NALL
RF,
*END STEP
*STEP
*STATIC
*BOUNDARY,OP=NEW
1    , 1    , 2
1    , 6
*TEMPERATURE,OP=MOD
*EL PRINT
 S,
 E,
 EE,
*NODE PRINT
 U,
*OUTPUT,FIELD
*NODE OUTPUT
U,
*ELEMENT OUTPUT
 S,E,EE
*OUTPUT,HISTORY
*ENERGY OUTPUT,VARIABLE=ALL
*ELEMENT OUTPUT,ELSET=EALL
 S,E,EE
*NODE OUTPUT,NSET=NALL
RF,U
*END STEP