*HEADING
: DLOADS FOR STRESS-DISPLACEMENT ELEMENTS  [MGAX2]
*NODE,NSET=NALL
*ELEMENT,TYPE=MGAX2, ELSET=EALL
*MEMBRANE SECTION,MATERIAL=MAT, ELSET=EALL
 .5,
*MATERIAL,NAME=MAT
*ELASTIC
 30.E6, .3
*DENSITY
 1.,
*BOUNDARY
 NALL, 1,2
 NALL, 5,5
*STEP,PERTURBATION
*STATIC
*OUTPUT,HISTORY,FREQUENCY=1
*ENERGY OUTPUT,VARIABLE=PRESELECT
*OUTPUT,FIELD
*NODE OUTPUT
RF,
*ENERGY PRINT
*EL PRINT
 LOADS,
*OUTPUT,FIELD
*ELEMENT OUTPUT
LOADS,
*NODE PRINT
 RF,
*DLOAD
 1, BR, 1000.
*END STEP
*STEP,PERTURBATION
*STATIC
*DLOAD
 1, BZ, 1000.
*END STEP
*STEP,PERTURBATION
*STATIC
*DLOAD
 1, CENT, 1000., 0.,0.,, 0.,1.,
*END STEP
*STEP,PERTURBATION
*STATIC
*DLOAD
 1,CENTRIF,1000.,,,,0.,1.,0.
*END STEP
*STEP,PERTURBATION
*STATIC
*DLOAD
 1,GRAV,400.,0.,-1.,0.
*END STEP
*STEP,PERTURBATION
*STATIC
*DLOAD
 1, P, 1000.
*END STEP
*STEP,PERTURBATION
*STATIC
*DLOAD
 1, HP, 1000., 12., 0.
*END STEP