*HEADING
 TEST OF REBAR: VERIFY MEMBRANE GIVES SAME RESULTS AS SHELL
**
**
*restart,write
*NODE,NSET=NALL
*NSET,NSET=TOP
*NSET,NSET=LEFT
*NSET,NSET=BOT
*NSET,NSET=RIGHT
*ELEMENT,TYPE=M3D4R,ELSET=MEMB1
*MEMBRANE SECTION,ELSET=MEMB1,MATERIAL=ELAS,POISSON=0.5
1.5,
*REBAR LAYER
REBM1,0.5,1.0,0,REBAR,30,1
REBM1_2,0.5,1.0,0,REBAR,-30,1
*ELEMENT,TYPE=S4R,ELSET=SHELL1
*SHELL SECTION,ELSET=SHELL1,MATERIAL=ELAS,POISSON=0.5
1.5,
*REBAR LAYER
REBS1,0.5,1.0,0,REBAR,30,1
REBS1_2,0.5,1.0,0,REBAR,-30,1
**
**
*NODE,NSET=NALL2
*NSET,NSET=TOP
*NSET,NSET=LEFT
*NSET,NSET=BOT
*NSET,NSET=RIGHT
*ORIENTATION,NAME=ORIENT2
*TRANSFORM,NSET=NALL2
*ELEMENT,TYPE=M3D4R,ELSET=MEMB2
*MEMBRANE SECTION,ELSET=MEMB2,MATERIAL=ELAS,POISSON=0.5
1.5,
*REBAR LAYER,ORI=ORIENT2
REBM2,0.5,1.0,0,REBAR,30,1
REBM2_2,0.5,1.0,0,REBAR,-30,1
*ELEMENT,TYPE=S4R,ELSET=SHELL2
*SHELL SECTION,ELSET=SHELL2,MATERIAL=ELAS,POISSON=0.5
1.5,
*REBAR LAYER,ORI=ORIENT2
REBS2,0.5,1.0,0,REBAR,30,1
REBS2_2,0.5,1.0,0,REBAR,-30,1
*NSET,NSET=NALL
NALL2,
**
**
*NODE,NSET=NALL3
*NSET,NSET=TOP
*NSET,NSET=LEFT
*NSET,NSET=BOT
*NSET,NSET=RIGHT
*ORIENTATION,NAME=ORIENT3
*TRANSFORM,NSET=NALL3
*ELEMENT,TYPE=M3D4R,ELSET=MEMB3
*MEMBRANE SECTION,ELSET=MEMB3,MATERIAL=ELAS,POISSON=0.5
1.5,
*REBAR LAYER,ORI=ORIENT3
REBM3,0.5,1.0,0,REBAR,30,1
REBM3_2,0.5,1.0,0,REBAR,-30,1
*ELEMENT,TYPE=S4R,ELSET=SHELL3
*SHELL SECTION,ELSET=SHELL3,MATERIAL=ELAS,POISSON=0.5
1.5,
*REBAR LAYER,ORI=ORIENT3
REBS3,0.5,1.0,0,REBAR,30,1
REBS3_2,0.5,1.0,0,REBAR,-30,1
*NSET,NSET=NALL
NALL3,
**
**
*NODE,NSET=NALL4
*NSET,NSET=TOP
*NSET,NSET=LEFT
*NSET,NSET=BOT
*NSET,NSET=RIGHT
*ORIENTATION,NAME=ORIENT4
*TRANSFORM,NSET=NALL4
*ELEMENT,TYPE=M3D4R,ELSET=MEMB4
*MEMBRANE SECTION,ELSET=MEMB4,MATERIAL=ELAS,POISSON=0.5
1.5,
*REBAR LAYER,ORI=ORIENT4
REBM4,0.5,1.0,0,REBAR,30,1
REBM4_2,0.5,1.0,0,REBAR,-30,1
*ELEMENT,TYPE=S4R,ELSET=SHELL4
*SHELL SECTION,ELSET=SHELL4,MATERIAL=ELAS,POISSON=0.5
1.5,
*REBAR LAYER,ORI=ORIENT4
REBS4,0.5,1.0,0,REBAR,30,1
REBS4_2,0.5,1.0,0,REBAR,-30,1
*NSET,NSET=NALL
NALL4,
**
**
**
*NODE,NSET=NALL5
*NSET,NSET=TOP
*NSET,NSET=LEFT
*NSET,NSET=BOT
*NSET,NSET=RIGHT
*ORIENTATION,NAME=ORIENT5
*TRANSFORM,NSET=NALL5
*ELEMENT,TYPE=M3D4R,ELSET=MEMB5
*MEMBRANE SECTION,ELSET=MEMB5,MATERIAL=ELAS,POISSON=0.5
1.5,
*REBAR LAYER,ORI=ORIENT5
REBM5,0.5,1.0,0,REBAR,30,1
REBM5_2,0.5,1.0,0,REBAR,-30,1
*ELEMENT,TYPE=S4R,ELSET=SHELL5
*SHELL SECTION,ELSET=SHELL5,MATERIAL=ELAS,POISSON=0.5
1.5,
*REBAR LAYER,ORI=ORIENT5
REBS5,0.5,1.0,0,REBAR,30,1
REBS5_2,0.5,1.0,0,REBAR,-30,1
*NSET,NSET=NALL
NALL5,
**
**
*NODE,NSET=NALL6
*NSET,NSET=TOP
*NSET,NSET=LEFT
*NSET,NSET=BOT
*NSET,NSET=RIGHT
*ORIENTATION,NAME=ORIENT6
*TRANSFORM,NSET=NALL6
*ELEMENT,TYPE=M3D4R,ELSET=MEMB6
*MEMBRANE SECTION,ELSET=MEMB6,MATERIAL=ELAS,POISSON=0.5
1.5,
*REBAR LAYER,ORI=ORIENT6
REBM6,0.5,1.0,0,REBAR,30,1
REBM6_2,0.5,1.0,0,REBAR,-30,1
*ELEMENT,TYPE=S4R,ELSET=SHELL6
*SHELL SECTION,ELSET=SHELL6,MATERIAL=ELAS,POISSON=0.5
1.5,
*REBAR LAYER,ORI=ORIENT6
REBS6,0.5,1.0,0,REBAR,30,1
REBS6_2,0.5,1.0,0,REBAR,-30,1
*NSET,NSET=NALL
NALL6,
**
*NODE,NSET=NALL7
*NSET,NSET=TOP
*NSET,NSET=LEFT
*NSET,NSET=BOT
*NSET,NSET=RIGHT
*ORIENTATION,NAME=ORIENT7
*ELEMENT,TYPE=M3D4R,ELSET=MEMB7
*MEMBRANE SECTION,ELSET=MEMB7,MATERIAL=ELAS,POISSON=0.5
1.5,
*REBAR LAYER,ORI=ORIENT7
REBM7,0.5,1.0,0,REBAR,-15,1
REBM7_2,0.5,1.0,0,REBAR,-75,1
*ELEMENT,TYPE=S4R,ELSET=SHELL7
*SHELL SECTION,ELSET=SHELL7,MATERIAL=ELAS,POISSON=0.5
1.5,
*REBAR LAYER,ORI=ORIENT7
REBS7,0.5,1.0,0,REBAR,-15,1
REBS7_2,0.5,1.0,0,REBAR,-75,1
*NSET,NSET=NALL
NALL7,
**
**
*NODE,NSET=NALL8
*NSET,NSET=TOP
*NSET,NSET=LEFT
*NSET,NSET=BOT
*NSET,NSET=RIGHT
*ORIENTATION,NAME=ORIENT8
*ELEMENT,TYPE=M3D4R,ELSET=MEMB8
*MEMBRANE SECTION,ELSET=MEMB8,MATERIAL=ELAS,POISSON=0.5
1.5,
*REBAR LAYER,ORI=ORIENT8
REBM8,0.5,1.0,0,REBAR,-75,1
REBM8_2,0.5,1.0,0,REBAR,-15,1
*ELEMENT,TYPE=S4R,ELSET=SHELL8
*SHELL SECTION,ELSET=SHELL8,MATERIAL=ELAS,POISSON=0.5
1.5,
*REBAR LAYER,ORI=ORIENT8
REBS8,0.5,1.0,0,REBAR,-75,1
REBS8_2,0.5,1.0,0,REBAR,-15,1
*NSET,NSET=NALL
NALL8,
**
**
*MATERIAL,NAME=ELAS
*ELASTIC
1.E-4, 0.25
*MATERIAL,NAME=REBAR
*ELASTIC
2.E4,
*****************
** LINEAR STEP **
*****************
*STEP,PERTURBATION
*STATIC
*BOUNDARY
NALL,3
LEFT,1
BOT,2
RIGHT,1,1, .001
**
*RESTART,WRITE
*EL PRINT,FREQ=0
*NODE PRINT,FREQ=0
**
** TESTS CASE 1)
**
*EL PRINT,ELSET=MEMB1,REBAR,FREQ=999
S,E,SENER,RBFOR,IVOL,RBANG,RBROT
*EL FILE,ELSET=MEMB1,REBAR,FREQ=999
S,E,ENER,RBFOR,IVOL,RBANG,RBROT
*EL PRINT,ELSET=SHELL1,REBAR,FREQ=999
S,E,SENER,RBFOR,IVOL,RBANG,RBROT
*EL FILE,ELSET=SHELL1,REBAR,FREQ=999
S,E,ENER,RBFOR,IVOL,RBANG,RBROT
**
** TESTS CASE 2)
**
*EL PRINT,ELSET=MEMB2,REBAR,FREQ=999
S,E,SENER,RBFOR,IVOL,RBANG,RBROT
*EL FILE,ELSET=MEMB2,REBAR,FREQ=999
S,E,ENER,RBFOR,IVOL,RBANG,RBROT
*EL PRINT,ELSET=SHELL2,REBAR,FREQ=999
S,E,SENER,RBFOR,IVOL,RBANG,RBROT
*EL FILE,ELSET=SHELL2,REBAR,FREQ=999
S,E,ENER,RBFOR,IVOL,RBANG,RBROT
**
** TESTS CASE 3)
**
*EL PRINT,ELSET=MEMB3,REBAR,FREQ=999
S,E,SENER,RBFOR,IVOL,RBANG,RBROT
*EL FILE,ELSET=MEMB3,REBAR,FREQ=999
S,E,ENER,RBFOR,IVOL,RBANG,RBROT
*EL PRINT,ELSET=SHELL3,REBAR,FREQ=999
S,E,SENER,RBFOR,IVOL,RBANG,RBROT
*EL FILE,ELSET=SHELL3,REBAR,FREQ=999
S,E,ENER,RBFOR,IVOL,RBANG,RBROT
**
** TESTS CASE 4)
**
*EL PRINT,ELSET=MEMB4,REBAR,FREQ=999
S,E,SENER,RBFOR,IVOL,RBANG,RBROT
*EL FILE,ELSET=MEMB4,REBAR,FREQ=999
S,E,ENER,RBFOR,IVOL,RBANG,RBROT
*EL PRINT,ELSET=SHELL4,REBAR,FREQ=999
S,E,SENER,RBFOR,IVOL,RBANG,RBROT
*EL FILE,ELSET=SHELL4,REBAR,FREQ=999
S,E,ENER,RBFOR,IVOL,RBANG,RBROT
**
** TESTS CASE 5)
**
*EL PRINT,ELSET=MEMB5,REBAR,FREQ=999
S,E,SENER,RBFOR,IVOL,RBANG,RBROT
*EL FILE,ELSET=MEMB5,REBAR,FREQ=999
S,E,ENER,RBFOR,IVOL,RBANG,RBROT
*EL PRINT,ELSET=SHELL5,REBAR,FREQ=999
S,E,SENER,RBFOR,IVOL,RBANG,RBROT
*EL FILE,ELSET=SHELL5,REBAR,FREQ=999
S,E,ENER,RBFOR,IVOL,RBANG,RBROT
**
** TESTS CASE 6)
**
*EL PRINT,ELSET=MEMB6,REBAR,FREQ=999
S,E,SENER,RBFOR,IVOL,RBANG,RBROT
*EL FILE,ELSET=MEMB6,REBAR,FREQ=999
S,E,ENER,RBFOR,IVOL,RBANG,RBROT
*EL PRINT,ELSET=SHELL6,REBAR,FREQ=999
S,E,SENER,RBFOR,IVOL,RBANG,RBROT
*EL FILE,ELSET=SHELL6,REBAR,FREQ=999
S,E,ENER,RBFOR,IVOL,RBANG,RBROT
**
** TESTS CASE 7)
**
*EL PRINT,ELSET=MEMB7,REBAR,FREQ=999
S,E,SENER,RBFOR,IVOL,RBANG,RBROT
*EL FILE,ELSET=MEMB7,REBAR,FREQ=999
S,E,ENER,RBFOR,IVOL,RBANG,RBROT
*EL PRINT,ELSET=SHELL7,REBAR,FREQ=999
S,E,SENER,RBFOR,IVOL,RBANG,RBROT
*EL FILE,ELSET=SHELL7,REBAR,FREQ=999
S,E,ENER,RBFOR,IVOL,RBANG,RBROT
**
** TESTS CASE 8)
**
*EL PRINT,ELSET=MEMB8,REBAR,FREQ=999
S,E,SENER,RBFOR,IVOL,RBANG,RBROT
*EL FILE,ELSET=MEMB8,REBAR,FREQ=999
S,E,ENER,RBFOR,IVOL,RBANG,RBROT
*EL PRINT,ELSET=SHELL8,REBAR,FREQ=999
S,E,SENER,RBFOR,IVOL,RBANG,RBROT
*EL FILE,ELSET=SHELL8,REBAR,FREQ=999
S,E,ENER,RBFOR,IVOL,RBANG,RBROT
**
*END STEP
********************
** NONLINEAR STEP **
********************
*STEP,NLGEOM
*STATIC
1., 1.
*BOUNDARY
NALL,3
LEFT,1
BOT,2
RIGHT,1,1, .001
*RESTART,WRITE
*EL PRINT,FREQ=0
*NODE PRINT,FREQ=0
**
**
** TESTS CASE 1)
**
*EL PRINT,ELSET=MEMB1,REBAR,FREQ=999
S,E,SENER,RBFOR,IVOL,RBANG,RBROT
*EL FILE,ELSET=MEMB1,REBAR,FREQ=999
S,E,ENER,RBFOR,IVOL,RBANG,RBROT
*EL PRINT,ELSET=SHELL1,REBAR,FREQ=999
S,E,SENER,RBFOR,IVOL,RBANG,RBROT
*EL FILE,ELSET=SHELL1,REBAR,FREQ=999
S,E,ENER,RBFOR,IVOL,RBANG,RBROT
**
** TESTS CASE 2)
**
*EL PRINT,ELSET=MEMB2,REBAR,FREQ=999
S,E,SENER,RBFOR,IVOL,RBANG,RBROT
*EL FILE,ELSET=MEMB2,REBAR,FREQ=999
S,E,ENER,RBFOR,IVOL,RBANG,RBROT
*EL PRINT,ELSET=SHELL2,REBAR,FREQ=999
S,E,SENER,RBFOR,IVOL,RBANG,RBROT
*EL FILE,ELSET=SHELL2,REBAR,FREQ=999
S,E,ENER,RBFOR,IVOL,RBANG,RBROT
**
** TESTS CASE 3)
**
*EL PRINT,ELSET=MEMB3,REBAR,FREQ=999
S,E,SENER,RBFOR,IVOL,RBANG,RBROT
*EL FILE,ELSET=MEMB3,REBAR,FREQ=999
S,E,ENER,RBFOR,IVOL,RBANG,RBROT
*EL PRINT,ELSET=SHELL3,REBAR,FREQ=999
S,E,SENER,RBFOR,IVOL,RBANG,RBROT
*EL FILE,ELSET=SHELL3,REBAR,FREQ=999
S,E,ENER,RBFOR,IVOL,RBANG,RBROT
**
** TESTS CASE 4)
**
*EL PRINT,ELSET=MEMB4,REBAR,FREQ=999
S,E,SENER,RBFOR,IVOL,RBANG,RBROT
*EL FILE,ELSET=MEMB4,REBAR,FREQ=999
S,E,ENER,RBFOR,IVOL,RBANG,RBROT
*EL PRINT,ELSET=SHELL4,REBAR,FREQ=999
S,E,SENER,RBFOR,IVOL,RBANG,RBROT
*EL FILE,ELSET=SHELL4,REBAR,FREQ=999
S,E,ENER,RBFOR,IVOL,RBANG,RBROT
**
** TESTS CASE 5)
**
*EL PRINT,ELSET=MEMB5,REBAR,FREQ=999
S,E,SENER,RBFOR,IVOL,RBANG,RBROT
*EL FILE,ELSET=MEMB5,REBAR,FREQ=999
S,E,ENER,RBFOR,IVOL,RBANG,RBROT
*EL PRINT,ELSET=SHELL5,REBAR,FREQ=999
S,E,SENER,RBFOR,IVOL,RBANG,RBROT
*EL FILE,ELSET=SHELL5,REBAR,FREQ=999
S,E,ENER,RBFOR,IVOL,RBANG,RBROT
**
** TESTS CASE 6)
**
*EL PRINT,ELSET=MEMB6,REBAR,FREQ=999
S,E,SENER,RBFOR,IVOL,RBANG,RBROT
*EL FILE,ELSET=MEMB6,REBAR,FREQ=999
S,E,ENER,RBFOR,IVOL,RBANG,RBROT
*EL PRINT,ELSET=SHELL6,REBAR,FREQ=999
S,E,SENER,RBFOR,IVOL,RBANG,RBROT
*EL FILE,ELSET=SHELL6,REBAR,FREQ=999
S,E,ENER,RBFOR,IVOL,RBANG,RBROT
**
** TESTS CASE 7)
**
*EL PRINT,ELSET=MEMB7,REBAR,FREQ=999
S,E,SENER,RBFOR,IVOL,RBANG,RBROT
*EL FILE,ELSET=MEMB7,REBAR,FREQ=999
S,E,ENER,RBFOR,IVOL,RBANG,RBROT
*EL PRINT,ELSET=SHELL7,REBAR,FREQ=999
S,E,SENER,RBFOR,IVOL,RBANG,RBROT
*EL FILE,ELSET=SHELL7,REBAR,FREQ=999
S,E,ENER,RBFOR,IVOL,RBANG,RBROT
**
** TESTS CASE 8)
**
*EL PRINT,ELSET=MEMB8,REBAR,FREQ=999
S,E,SENER,RBFOR,IVOL,RBANG,RBROT
*EL FILE,ELSET=MEMB8,REBAR,FREQ=999
S,E,ENER,RBFOR,IVOL,RBANG,RBROT
*EL PRINT,ELSET=SHELL8,REBAR,FREQ=999
S,E,SENER,RBFOR,IVOL,RBANG,RBROT
*EL FILE,ELSET=SHELL8,REBAR,FREQ=999
S,E,ENER,RBFOR,IVOL,RBANG,RBROT
**
*END STEP