*HEADING
This is a test of angular acceleration loading for M3D9R elements.
*NODE,NSET=ALL
*ELEMENT,TYPE=M3D9R,ELSET=EALL
*MEMBRANE SECTION,MATERIAL=STEEL,ELSET=EALL
1.,
*MATERIAL,NAME=STEEL
*ELASTIC
30.E6,.33
*DENSITY
2000.,
*BOUNDARY
ALL,1,3
*STEP
*STATIC
*DLOAD
EALL,ROTA,10.,0.,0.,0.,0,0,1
*NODE PRINT,TOTALS=YES
RF,
*EL PRINT
EVOL,
*OUTPUT,FIELD
*NODE OUTPUT
RF,
*OUTPUT,FIELD,FREQ=0
*ELEMENT OUTPUT
*END STEP