*HEADING
: DLOADS AND *TEMPERATURE FOR STRESS-DISPLACEMENT ELEMENTS  [M3D8]
*NODE
*NGEN,NSET=BOTTOM
*NGEN,NSET=TOP
*NGEN,NSET=LEFT
*NGEN,NSET=RIGHT
*NSET,NSET=ALL,GENERATE
*ELEMENT,TYPE=M3D8, ELSET=EALL
*MEMBRANE SECTION,MATERIAL=A1, ELSET=EALL
2.,
*MATERIAL,NAME=A1
*ELASTIC
3.E6      , 0.3
*EXPANSION
0.0001,
*DENSITY
 1.0,
*INITIAL CONDITIONS,TYPE=TEMPERATURE
ALL  , -10.
*BOUNDARY
ALL  , 1    , 3
*STEP,PERTURBATION
*STATIC
*OUTPUT,HISTORY,FREQUENCY=1
*ENERGY OUTPUT,VARIABLE=PRESELECT
*OUTPUT,FIELD
*NODE OUTPUT
RF,
*DLOAD
1,BX,1000.
*EL PRINT, TOTALS=YES
 LOADS,
 IVOL,
 EVOL,
*OUTPUT,FIELD
*ELEMENT OUTPUT
LOADS,
IVOL,
EVOL,
*NODE PRINT
 RF,
*END STEP
*STEP,PERTURBATION
*STATIC
*DLOAD
1,BY,2000.
*END STEP
*STEP,PERTURBATION
*STATIC
*DLOAD
 1,BZ,3000.
*END STEP
*STEP,PERTURBATION
*STATIC
*DLOAD
 1,GRAV,3000.,0,0,1.
*END STEP
*STEP,PERTURBATION
*STATIC
*DLOAD
1,CENT,3000.,0.,0.,0.,0.,1.,0.
*END STEP
*STEP,PERTURBATION
*STATIC
*DLOAD
1,CENTRIF,3000.,0.,0.,0.,0.,1.,0.
*END STEP
*STEP,PERTURBATION
*STATIC
*DLOAD
1,HP,3000.,7.,0.
*END STEP
*STEP,PERTURBATION
*STATIC
*DLOAD
1,P,1000.
*END STEP
*STEP,PERTURBATION
*STATIC
*TEMPERATURE
ALL,40.
*OUTPUT,FIELD
*ELEMENT OUTPUT
S,
*OUTPUT,FIELD
*NODE OUTPUT
RF,
U,
*EL PRINT
 S,
*NODE PRINT
 RF,
 U,
*END STEP
*STEP,PERTURBATION
*STATIC
*BOUNDARY,OP=NEW
 ALL,3,6
LEFT,1
BOTTOM,2
*TEMPERATURE,OP=MOD
ALL,40.
*END STEP