*HEADING
: DLOADS AND *TEMPERATURE FOR STRESS-DISPLACEMENT ELEMENTS  [M3D6]
*PREPRINT,ECHO=YES,HISTORY=NO,MODEL=NO
*NODE
*NGEN,NSET=BOTTOM
*NGEN,NSET=TOP
*NGEN,NSET=LEFT
*NGEN,NSET=RIGHT
*NGEN,NSET=ALL
*NSET,NSET=ALL,GENERATE
*ELEMENT,TYPE=M3D6,ELSET=ELEMS
*MEMBRANE SECTION,MATERIAL=A1, ELSET=ELEMS
2.,
*MATERIAL,NAME=A1
*ELASTIC
3.E6      , 0.3
*EXPANSION
0.0001,
*DENSITY
 1.,
*INITIAL CONDITIONS,TYPE=TEMPERATURE
ALL  , -10.
*BOUNDARY
ALL  , 1    , 3
*STEP,PERTURBATION
*STATIC
*OUTPUT,HISTORY,FREQUENCY=1
*ENERGY OUTPUT,VARIABLE=PRESELECT
*OUTPUT,FIELD
*NODE OUTPUT
RF,
*DLOAD
ELEMS,BX,1000.
*EL PRINT
 LOADS,
*OUTPUT,FIELD
*ELEMENT OUTPUT
LOADS,
*NODE PRINT
 RF,
*END STEP
*STEP,PERTURBATION
*STATIC
*DLOAD
ELEMS,BY,2000.
*END STEP
*STEP,PERTURBATION
*STATIC
*DLOAD
 ELEMS,BZ,3000.
*END STEP
*STEP,PERTURBATION
*STATIC
*DLOAD
 ELEMS,GRAV,3000.,0,0,1.
*END STEP
*STEP,PERTURBATION
*STATIC
*DLOAD
ELEMS,CENT,3000.,0.,0.,0.,0.,1.,0.
*END STEP
*STEP,PERTURBATION
*STATIC
*DLOAD
ELEMS,CENTRIF,3000.,0.,0.,0.,0.,1.,0.
*END STEP
*STEP,PERTURBATION
*STATIC
*DLOAD
ELEMS,HP,3000.,7.,0.
*END STEP
*STEP,PERTURBATION
*STATIC
*DLOAD
ELEMS,P,1000.
*END STEP
*STEP,PERTURBATION
*STATIC
*TEMPERATURE
ALL,40.
*OUTPUT,FIELD
*ELEMENT OUTPUT
S,
*OUTPUT,FIELD
*NODE OUTPUT
RF,
U,
*EL PRINT
 S,
*NODE PRINT
 RF,
 U,
*END STEP
*STEP,PERTURBATION
*STATIC
*BOUNDARY,OP=NEW
 ALL,3
LEFT,1
BOTTOM,2
*TEMPERATURE,OP=MOD
ALL,40.
*END STEP