*HEADING
3-D ELEMENT IN CONTACT WITH A RIGID ANALYTICAL SURFACE.
NORMALS ARE MODIFIED. VERIFICATION FOR *CLEARANCE OPTION.
*NODE
*ELEMENT,TYPE=C3D8,ELSET=BOT
*rigid body,analytical surface=TOPS,REF NODE=15
*surface,TYPE=CYLINDER,NAME=TOPS
START,-1.0,-1.0,-1.0
LINE,2.0,-1.0,-1.0
*SOLID SECTION,ELSET=BOT,MATERIAL=MAT
*MATERIAL,NAME=MAT
*ELASTIC
3.E7,0.0
*surface,NAME=SLAVE
BOT,S5
*CLEARANCE,SLAVE=SLAVE,MASTER=TOPS,TABULAR
*SURFACE INTERACTION,NAME=ISLS
*CONTACT PAIR,INTERACTION=ISLS, SMALL SLIDING, TYPE=SURFACE TO SURFACE
SLAVE,TOPS
*BOUNDARY
1,1,3
2,1,3
5,1,3
6,1,3
15,1,1
15,3,6
*STEP,INC=50,NLGEOM
*STATIC
0.1,1.0
*BOUNDARY
15,2,2,-0.2
*PRINT,CONTACT=YES
*NODE FILE,FREQ=100
U,RF
*EL FILE,FREQ=100
S,
E,
*ENDSTEP