*HEADING
SIMPLE CONTACT TEST, COUPLED TEMPERATURE-DISPLACEMENT ()
*RESTART, WRITE
*NODE
*NGEN,NSET=NALL
*NSET,NSET=BOTTOM
*NSET,NSET=TOP
*NSET,NSET=LEFT
*ELEMENT,TYPE=CPE6MHT,ELSET=SOLID
*SOLID SECTION,ELSET=SOLID,MATERIAL=SOLMAT
*MATERIAL,NAME=SOLMAT
*ELASTIC
30.E6,.3
*EXPANSION
10.E-6,
*CONDUCTIVITY
43.0,
*DENSITY
7700.,
*SPECIFIC HEAT
600.,
*SURFACE INTERACTION, NAME=GAP
1.0,
*FRICTION
0.01,
*GAP CONDUCTANCE
*GAP RADIATION
** converted from old data: 1.E-9, 1.E-9
*GAP HEAT GENERATION
**
*PHYSICAL CONSTANTS, ABSOLUTE ZERO=-273.16, STEFANB=5.6697E-8
**
*** nset definitions for prescribing temperatures.
**
*NSET, NSET=NELEM12, GEN
*NSET, NSET=NELEM36, GEN
**
** surfaces
**
*surface, NAME=ASURF
1, S2
*surface, NAME=BSURF
4, S2
6, S2
*CONTACT PAIR, SMALL SLIDING, INTERACTION=GAP
BSURF, ASURF
*surface, NAME=ATIED
3, S2
5, S2
*surface, NAME=BTIED
8, S2
*CONTACT PAIR, SMALL SLIDING, TIED, ADJUST=0.01, INTERACTION=GAP
ATIED, BTIED
**
*** Apply different temperatures to the nodes above and
*** below the contact surface
**
*STEP
*COUPLED TEMPERATURE-DISPLACEMENT,STEADY STATE
*ENERGY FILE
*EL FILE
 S,
 E,
 EE,
TEMP,
*NODE FILE
RF,
NT,
RFL,
*ENERGY PRINT
*EL PRINT ,SUM=NO
 S,E
 EE,
TEMP,
*NODE PRINT,SUM=NO
RF,
NT,RFL
U,
*BOUNDARY
BOTTOM,2,2
TOP,2,2
NELEM12, 11, 11, 700.0
NELEM36, 11, 11, 500.0
1,1,1,0.0
41,1,1,0.0
*CONTACT PRINT
CSTRESS,CDISP
HFL,HFLA,HTL
SFDR,SFDRA
*CONTACT FILE
CSTRESS,CDISP
HFL,HFLA,HTL
SFDR,SFDRA
*END STEP
**
**** STEP 2. Push top block to the right.
**
*STEP, NLGEOM ,INC=10
*COUPLED TEMPERATURE-DISPLACEMENT,STEADY STATE
0.1,1.0,0.1,0.1
*BOUNDARY
11, 1, 1, 0.01
16, 1, 1, 0.01
31, 1, 1, 0.01
36, 1, 1, 0.01
41, 1, 1, 0.01
NELEM12, 11, 11, 700
NELEM36, 11, 11, 500
TOP, 2, 2
BOTTOM, 2, 2
*BOUNDARY,FIXED
1, 1, 1
4, 1, 1
7, 1, 1
*EL FILE
S,
E,
*NODE FILE
RF,
NT, RFL
*CONTACT PRINT
CSTRESS,CDISP
HFL,HFLA,HTL
SFDR, SFDRA
*CONTACT FILE
CSTRESS,CDISP
HFL,HFLA,HTL
SFDR,SFDRA
*END STEP
**
*** STEP 3. Push top block back into position.
**
*STEP, NLGEOM, INC=10
*COUPLED TEMPERATURE-DISPLACEMENT,STEADY STATE
0.1,1.0,0.1,0.1
*BOUNDARY, OP=NEW
NELEM12, 11, 11, 700
NELEM36, 11, 11, 500
TOP, 2, 2
BOTTOM, 2, 2
1,  1, 1, 0.0
4,  1, 1, 0.0
7,  1, 1, 0.0
11, 1, 1, 0.0
16, 1, 1, 0.0
31, 1, 1, 0.0
36, 1, 1, 0.0
41, 1, 1, 0.0
*EL FILE
S,
E,
*NODE FILE
RF,
NT, RFL
*CONTACT PRINT
CSTRESS,CDISP
HFL,HFLA,HTL
SFDR,SFDRA
*CONTACT FILE
CSTRESS,CDISP
HFL,HFLA,HTL
SFDR,SFDRA
*END STEP
**
**** test for linear perturbation
***
*STEP,NLGEOM,PERTURBATION
*STATIC
*BOUNDARY,OP=NEW
BOTTOM,2,2
TOP ,2,2 , 0.05
1,  1, 1, 0.0
41, 1, 1, 0.0
*ENERGY FILE
*EL FILE
 S,
 E,
*NODE FILE
 RF,
*ENERGY PRINT
*EL PRINT ,SUM=NO
 S,E
TEMP,
*NODE PRINT,SUM=NO
RF,
NT,
*CONTACT PRINT
*CONTACT FILE
*END STEP