*HEADING
: CORIOLIS LOAD  [CPS8R]
*PREPRINT,ECHO=YES,HISTORY=NO,MODEL=NO
*NODE,NSET=NALL
*NGEN,NSET=NALL
*ELEMENT,TYPE=CPS8R, ELSET=EALL
*SOLID SECTION,MATERIAL=A1, ELSET=EALL
*MATERIAL,NAME=A1
*ELASTIC
 3.E6,.3
*STEP
*STATIC
.0001,.0001
*BOUNDARY
 NALL,1,1,.001
 NALL,2,2,.0005
*ENERGY FILE
*OUTPUT,HISTORY,FREQUENCY=1
*ENERGY OUTPUT,VARIABLE=PRESELECT
*NODE FILE
 RF,
*OUTPUT,FIELD
*NODE OUTPUT
RF,
*DLOAD
 1,CORIO,5.,0.,0.,0.,  0.,0.,1.
*EL PRINT
 LOADS,
*EL FILE
 LOADS,
*OUTPUT,FIELD
*ELEMENT OUTPUT
LOADS,
*NODE PRINT
 RF,
*END STEP