*HEADING
: FOUNDATION TYPE F3  [CPS6M]
*PREPRINT,ECHO=YES,HISTORY=NO,MODEL=NO
*NODE
*NGEN,NSET=ALL
*ELEMENT,TYPE=CPS6M, ELSET=EALL
*FOUNDATION
 2,F3,300.
*SOLID SECTION,MATERIAL=A1, ELSET=EALL
*MATERIAL,NAME=A1
*ELASTIC,TYPE=ISOTROPIC
 3.E+6,0.3
*STEP,PERTURBATION
*STATIC
*ENERGY FILE
*OUTPUT,HISTORY,FREQUENCY=1
*ENERGY OUTPUT,VARIABLE=PRESELECT
*NODE FILE
 RF,
*OUTPUT,FIELD
*NODE OUTPUT
RF,
*BOUNDARY
 ALL,1,2,0.1
*EL PRINT,FREQ=0
*NODE PRINT,TOTALS=YES
 RF,
*END STEP