*HEADING
**
** ABAQUS INPUT FILE UPGRADE: This input file was upgraded from
** version 5.8 or later to version 6.3 with 0 warning(s) and 0
** error(s).
**
**
 : RESPONSE SPECTRUM ANALYSIS FOR CAXA82
*RESTART, WRITE
*NODE
*ELEMENT, TYPE=CAXA82, ELSET=EALL, OFFSET=1000
*SOLID SECTION, MATERIAL=STEEL, ELSET=EALL
*MATERIAL, NAME=STEEL
*ELASTIC
5.E2,
*DENSITY
0.000728,
*NSET, NSET=BASE
*NSET, NSET=ATIE
*NSET, NSET=BTIE
*NSET, NSET=CTIE
*EQUATION
BTIE, 1, 1, ATIE, 1, 1
CTIE, 1, 1, ATIE, 1, 1
BTIE, 2, 1, ATIE, 2, -1
CTIE, 2, 1, ATIE, 2, -1
*BOUNDARY
BASE, 1, 2
*SPECTRUM, TYPE=DISPLACEMENT, NAME=CANTIL
*STEP
*FREQUENCY, eigensolver=lanczos, SIM=NO
10, ,
*EL PRINT,FREQ=0
*NODE PRINT
 U,
*MODAL FILE
*END STEP
*STEP
RESPONSE SPECTRUM
*RESPONSE SPECTRUM,COMP=SRSS,SUM=TENP
CANTIL,1.,0.,0.,1.
CANTIL,0.,1.,0.,1.
*modal damping
*EL PRINT,F=0
*NODE PRINT,F=1
U,
*NODE FILE
U,
*END STEP