*HEADING
: DLOADS AND *TEMPERATURE FOR STRESS-DISPLACEMENT ELEMENTS  [CAXA8RH1]
*NODE,NSET=PLANE1
*NGEN,NSET=PLANE1
*ELEMENT,TYPE=CAXA8RH1,OFFSET=10, ELSET=EALL
*SOLID SECTION,MATERIAL=MATPROP, ELSET=EALL
*MATERIAL,NAME=MATPROP
*ELASTIC
 30E6,0.3
*NSET,NSET=BOTTOM,GEN
*NSET,NSET=TOP,GEN
*NSET,NSET=NALL,G
*BOUNDARY
NALL,1,2
*STEP,PERTURBATION
*STATIC
*DLOAD
1,BZ,1500.
*NODE FILE
RF,
*OUTPUT,FIELD
*NODE OUTPUT
RF,
*EL PRINT,FREQ=0
S,
*NODE PRINT,FREQ=0
RF,
*END STEP
*STEP,PERTURBATION
*STATIC
*DLOAD
1,HP1,10000.,1.E6,0.
*END STEP
*STEP,PERTURBATION
*STATIC
*DLOAD
1,HP2,10000.,1.E6,0.
*END STEP
*STEP,PERTURBATION
*STATIC
*DLOAD
1,HP3,10000.,1.E6,0.
*END STEP
*STEP,PERTURBATION
*STATIC
*DLOAD
1,HP4,10000.,1.E6,0.
*END STEP
*STEP,PERTURBATION
*STATIC
*DLOAD
1,P1,20000.
*END STEP
*STEP,PERTURBATION
*STATIC
*DLOAD
1,P2,30000.
*END STEP
*STEP,PERTURBATION
*STATIC
*DLOAD
1,P3,20000.
*END STEP
*STEP,PERTURBATION
*STATIC
*DLOAD
1,P4,30000.
*END STEP