*HEADING
: NAFEMS TEST FV42, [CAXA42]
Stress displacement elements
*RESTART,WRITE
*NODE,SYSTEM=C
*NGEN,NSET=BOT
*NSET,NSET=BOT,GEN
*NGEN,NSET=TOP
*NSET,NSET=TOP,GEN
*NSET,NSET=ALLN
TOP,BOT
*TRANSFORM,TYPE=C,NSET=ALLN
**
*ELEMENT,TYPE=CAXA42
*ELGEN,ELSET=ALLE
*SOLID SECTION,ELSET=ALLE,MATERIAL=MAT
*MATERIAL,NAME=MAT
*ELASTIC
200.E9,0.3
*DENSITY
8000.,
**
*BOUNDARY
ALLN,2
*EQUATION
TOP,1,1.0, BOT,1,-1.0
*STEP,PERT
*FREQUENCY, eigensolver=lanczos, SIM=NO
11,
*MODAL FILE
*NODE PRINT
U1,
*ENDSTEP