*HEADING
This is a test of angular acceleration loading for CPEG6MHT elements.
*NODE,NSET=ALL
*NODE
*NODE,NSET=XTRA
*ELEMENT,TYPE=CPEG6MHT,ELSET=EALL
*SOLID SECTION,MATERIAL=STEEL,ELSET=EALL,REFNODE=XTRA
 1.      ,
*MATERIAL,NAME=STEEL
*ELASTIC
 30.E6,.33
*DENSITY
 2000.   ,
*CONDUCTIVITY
 1.,
*BOUNDARY
 ALL,1,2
 998,3,5
*STEP
*STATIC
*DLOAD
 EALL,ROTA,10.,0.,0.,0.,0,0,1
*NODE PRINT,TOTALS=YES
 RF,
*EL PRINT
 EVOL,
*NODE FILE
 RF,
*OUTPUT,FIELD
*NODE OUTPUT
 RF,
*EL FILE,FREQ=0
*OUTPUT,FIELD,FREQ=0
*ELEMENT OUTPUT
*END STEP