*HEADING
: MEMBRANE LOADING  [CPE6MH]
*PREPRINT,ECHO=YES,HISTORY=YES,MODEL=YES
*NODE
*ELEMENT,TYPE=CPEG6MH, ELSET=EALL
*SOLID SECTION,MATERIAL=A1, ELSET=EALL, REFNODE=1001
 1.0,
*MATERIAL,NAME=A1
*ELASTIC,TYPE=ISOTROPIC
 30.0E6,0.3
*BOUNDARY
 1,1,2
 2,2
*STEP
*STATIC
*DLOAD,OP=NEW
 1, P1, 1000.0
 1, P2, 1000.0
 2, P2, 1000.0
 2, P3, 1000.0
*CLOAD
 2,1,   500.00
 3,1,  -500.00
 3,2,  -250.00
 4,2,   250.00
 4,1,  -500.00
 5,1,  1000.00
 6,2,  -500.00
 7,1, -1000.00
*EL FILE
 S,COORD,
 E,
 LOADS,
*OUTPUT,FIELD
*ELEMENT OUTPUT
S,COORD,
E,
LOADS,
*ENERGY FILE
*OUTPUT,HISTORY,FREQUENCY=1
*ENERGY OUTPUT,VARIABLE=PRESELECT
*NODE FILE
 U,COORD
*OUTPUT,FIELD
*NODE OUTPUT
U,COORD
*NODE PRINT
 U,COORD
*EL PRINT
 S,COORD,
 E,
 LOADS,
*END STEP
*STEP
*STATIC
*DLOAD,OP=MOD
1,HP2,1000.,1.0,0.0
2,HP3,1000.,1.0,0.0
*END STEP