*HEADING
: FOUNDATION TYPE F1  [CPEG6]
*PREPRINT,ECHO=YES,HISTORY=NO,MODEL=NO
*NODE
*NGEN,NSET=ALL
*NODE
*ELEMENT,TYPE=CPEG6,ELSET=ELEMS
*SOLID SECTION,MATERIAL=A1,ELSET=ELEMS,REFNODE=101
 1.,
*FOUNDATION
 1,F1,300.
*MATERIAL,NAME=A1
*ELASTIC,TYPE=ISOTROPIC
 3.E+6,0.3
*BOUNDARY
 ALL,1
*STEP,PERTURBATION
*STATIC
*ENERGY FILE
*OUTPUT,HISTORY,FREQUENCY=1
*ENERGY OUTPUT,VARIABLE=PRESELECT
*NODE FILE
 RF,
*OUTPUT,FIELD
*NODE OUTPUT
 RF,
*BOUNDARY
 ALL,2,,-0.1
*EL PRINT,FREQ=0
*NODE PRINT
 RF,
*END STEP