*HEADING
: DLOADS AND *TEMPERATURE FOR STRESS-DISPLACEMENT ELEMENTS  [CPEG6]
*PREPRINT,ECHO=YES,HISTORY=NO,MODEL=NO
*NODE
*NGEN,NSET=BOTTOM
*NGEN,NSET=TOP
*NGEN,NSET=LEFT
*NGEN,NSET=RIGHT
*NGEN
*NSET,NSET=ALL,GENERATE
*NODE
*ELEMENT,TYPE=CPEG6,ELSET=ELEMS
*SOLID SECTION,MATERIAL=A1,ELSET=ELEMS,REFNODE=101
 1.,
*MATERIAL,NAME=A1
*ELASTIC,TYPE=ISOTROPIC
 3.E6      , 0.3
*EXPANSION
 0.0001,
*DENSITY
 5.E-5,
*INITIAL CONDITION,TYPE=TEMPERATURE
 ALL  , -10.
*BOUNDARY
 ALL  , 1    , 2
*STEP,PERTURBATION
*STATIC
*ENERGY FILE
*OUTPUT,HISTORY,FREQUENCY=1
*ENERGY OUTPUT,VARIABLE=PRESELECT
*NODE FILE
 RF,
*OUTPUT,FIELD
*NODE OUTPUT
 RF,
*DLOAD
ELEMS,BX,1000.
*EL PRINT
 LOADS,
*EL FILE
 LOADS,
*OUTPUT,FIELD
*ELEMENT OUTPUT
 LOADS,
*NODE PRINT
 RF,
*END STEP
*STEP,PERTURBATION
*STATIC
*DLOAD
 ELEMS,BY,2000.
*END STEP
*STEP,PERTURBATION
*STATIC
*DLOAD
 ELEMS,CENT,3000.,0.,0.,0.,0.,1.,0.
*END STEP
*STEP,PERTURBATION
*STATIC
*DLOAD
 ELEMS,CENTRIF,6.E7,0.,0.,0.,0.,1.,0.
*END STEP
*STEP,PERTURBATION
*STATIC
*DLOAD
 ELEMS,GRAV,400.,0.,-1.,0.
*END STEP
*STEP,PERTURBATION
*STATIC
*DLOAD
 1,HP1,3000.,3.,0.
*END STEP
*STEP,PERTURBATION
*STATIC
*DLOAD
 1,HP2,3000.,3.,0.
*END STEP
*STEP,PERTURBATION
*STATIC
*DLOAD
 2,HP2,3000.,3.,0.
*END STEP
*STEP,PERTURBATION
*STATIC
*DLOAD
 2,HP3,3000.,3.,0.
*END STEP
*STEP,PERTURBATION
*STATIC
*DLOAD
 1,P1,1000.
*END STEP
*STEP,PERTURBATION
*STATIC
*DLOAD
 1,P2,2000.
*END STEP
*STEP,PERTURBATION
*STATIC
*DLOAD
 2,P2,3000.
*END STEP
*STEP,PERTURBATION
*STATIC
*DLOAD
 2,P3,3000.
*END STEP
*STEP,PERTURBATION
*STATIC
*TEMPERATURE
 ALL,40.
*EL FILE
 S ,
*OUTPUT,FIELD
*ELEMENT OUTPUT
 S,
*NODE FILE
 RF,U
*OUTPUT,FIELD
*NODE OUTPUT
 RF,U
*EL PRINT
 S,
*NODE PRINT
 RF,
 U,
*END STEP
*STEP,PERTURBATION
*STATIC
*BOUNDARY,OP=NEW
 LEFT,1
BOTTOM,2
*TEMPERATURE,OP=MOD
 ALL,40.
*END STEP