*HEADING
This is a test of angular acceleration loading for CPEG4RH elements.
*NODE,NSET=ALL
*NODE,NSET=REFND
*ELEMENT,TYPE=CPEG4RH,ELSET=EALL
*SOLID SECTION,MATERIAL=STEEL,ELSET=EALL,REFNODE=9
 1.,
*MATERIAL,NAME=STEEL
*ELASTIC
 30.E6,.33
*DENSITY
 2000.,
*BOUNDARY
 ALL,1,3
 REFND,3,5
*STEP
*STATIC
*DLOAD
 EALL,ROTA,10.,0.,0.,0.,0,0,1
*NODE PRINT,TOTALS=YES
 RF ,
*EL PRINT
 EVOL,
*NODE FILE
 RF ,
*OUTPUT,FIELD
*NODE OUTPUT
 RF,
*EL FILE,FREQ=0
*OUTPUT,FIELD,FREQ=0
*ELEMENT OUTPUT
*END STEP