*HEADING
: *DSLOADS AND *TEMPERATURE FOR STRESS-DISPLACEMENT ELEMENTS  [CPE8RH]
*NODE
*NGEN,NSET=BOTTOM
*NGEN,NSET=TOP
*NGEN,NSET=LEFT
*NGEN,NSET=RIGHT
*NSET,NSET=ALL,GENERATE
*ELEMENT,TYPE=CPE8RH, ELSET=EALL
*surface, NAME=SIDE_1
 1, S1
*surface, NAME=SIDE_2
 1, S2
*surface, NAME=SIDE_3
 1, S3
*surface, NAME=SIDE_4
 1, S4
*SOLID SECTION,MATERIAL=A1, ELSET=EALL
*MATERIAL,NAME=A1
*ELASTIC
3.E6      , 0.3
*EXPANSION
0.0001,
*DENSITY
5.E-5,
*INITIAL CONDITION,TYPE=TEMPERATURE
ALL  , -10.
*BOUNDARY
ALL  , 1    , 2
*STEP,PERTURBATION
*STATIC
*ENERGY FILE
*OUTPUT,HISTORY,FREQUENCY=1
*ENERGY OUTPUT,VARIABLE=PRESELECT
*NODE FILE
 RF,
*OUTPUT,FIELD
*NODE OUTPUT
RF,
*EL PRINT
 LOADS,
*EL FILE
 LOADS,
*OUTPUT,FIELD
*ELEMENT OUTPUT
LOADS,
*NODE PRINT
 RF,
*DSLOAD
SIDE_1,HP,3000.,3.,0.
*END STEP
*STEP,PERTURBATION
*STATIC
*DSLOAD
SIDE_2,HP,3000.,3.,0.
*END STEP
*STEP,PERTURBATION
*STATIC
*DSLOAD
SIDE_3,HP,3000.,3.,0.
*END STEP
*STEP,PERTURBATION
*STATIC
*DSLOAD
SIDE_4,HP,3000.,3.,0.
*END STEP
*STEP,PERTURBATION
*STATIC
*DSLOAD
SIDE_1,P,1000.
*END STEP
*STEP,PERTURBATION
*STATIC
*DSLOAD
SIDE_2,P,2000.
*END STEP
*STEP,PERTURBATION
*STATIC
*DSLOAD
SIDE_3,P,3000.
*END STEP
*STEP,PERTURBATION
*STATIC
*DSLOAD
SIDE_4,P,3000.
*END STEP
*STEP,PERTURBATION
*STATIC
*TEMPERATURE
ALL,40.
*EL FILE
 S,
*OUTPUT,FIELD
*ELEMENT OUTPUT
S,
*NODE FILE
 RF,U
*OUTPUT,FIELD
*NODE OUTPUT
RF,U
*EL PRINT
 S,
*NODE PRINT
 RF,U
*END STEP
*STEP,PERTURBATION
*STATIC
*BOUNDARY,OP=NEW
LEFT,1
BOTTOM,2
*TEMPERATURE,OP=MOD
ALL,40.
*END STEP