*HEADING
: FOUNDATION TYPE F2  [CPE8R]
*PREPRINT,ECHO=YES,HISTORY=NO,MODEL=NO
*NODE
*NGEN,NSET=ALL
*ELEMENT,TYPE=CPE8R, ELSET=EALL
*FOUNDATION
1,F2,300.
*SOLID SECTION,MATERIAL=A1, ELSET=EALL
*MATERIAL,NAME=A1
*ELASTIC
 3.E+6,0.3
*STEP,PERTURBATION
*STATIC
*ENERGY FILE
*OUTPUT,HISTORY,FREQUENCY=1
*ENERGY OUTPUT,VARIABLE=PRESELECT
*NODE FILE
 RF,
*OUTPUT,FIELD
*NODE OUTPUT
RF,
*BOUNDARY
 ALL,1,2,0.1
*EL PRINT,FREQ=0
*NODE PRINT
 RF,
*END STEP