*HEADING
ECE6TKP4: PATCH TEST FOR HEAT TRANSFER ELEMENTS  [CPE6MT]
*PREPRINT,ECHO=YES,HISTORY=NO,MODEL=NO
*NODE,NSET=NALL
*NGEN,NSET=NALL
*ELEMENT,TYPE=CPE6MT, ELSET=EALL
*NSET,NSET=SIDES,GENERATE
*SOLID SECTION,MATERIAL=A1, ELSET=EALL
*MATERIAL,NAME=A1
*ELASTIC
 30e6, 0.0
*CONDUCTIVITY
4.85E-4,
*DENSITY
0.283,
*SPECIFIC HEAT
0.116,
*STEP
 STEADY STATE
*COUPLED TEMPERATURE-DISPLACEMENT,STEADY STATE
*BOUNDARY
NALL,1,2
10,11, ,  0.0
20,11, , 48.0
30,11, , 60.0
40,11, , 12.0
50,11, , 24.0
60,11, , 54.0
70,11, , 36.0
80,11, ,  6.0
*NODE PRINT, FREQUENCY=0
*EL PRINT
 HFL,
*EL PRINT,POSITION=NODES
 HFL,
*EL PRINT,POSITION=AVERAGED AT NODES
 HFL,
*EL PRINT,POSITION=CENTROID
 HFL,
*EL FILE
 HFL,
*EL FILE,POSITION=NODES
 HFL,
*EL FILE,POSITION=AVERAGED AT NODES
 HFL,
*EL FILE,POSITION=CENTROID
 HFL,
*ENDSTEP