*HEADING
: DLOADS AND *TEMPERATURE FOR STRESS-DISPLACEMENT ELEMENTS  [CPE4R]
*PREPRINT,ECHO=YES,HISTORY=NO,MODEL=NO
*NODE,NSET=ALL
*NSET,NSET=LEFT
*NSET,NSET=BOT
*ELEMENT,TYPE=CPE4R, ELSET=EALL
*SOLID SECTION,MATERIAL=A1, ELSET=EALL
*MATERIAL,NAME=A1
*ELASTIC
3.E6      , 0.3
*EXPANSION
0.0001,
*DENSITY
5.E-5,
*INITIAL CONDITION,TYPE=TEMPERATURE
ALL  , -10.
*BOUNDARY
ALL  , 1    , 2
*STEP,PERTURBATION
*STATIC
*ENERGY FILE
*OUTPUT,HISTORY,FREQUENCY=1
*ENERGY OUTPUT,VARIABLE=PRESELECT
*NODE FILE
 RF,
*OUTPUT,FIELD
*NODE OUTPUT
RF,
*DLOAD
1,BX,3000.
*EL PRINT
 LOADS,
*EL FILE
 LOADS,
*OUTPUT,FIELD
*ELEMENT OUTPUT
LOADS,
*NODE PRINT
 RF,
*END STEP
*STEP,PERTURBATION
*STATIC
*DLOAD
1,BY,3000.
*END STEP
*STEP,PERTURBATION
*STATIC
*DLOAD
1,CENT,3000.,0.,0.,0.,0.,1.,0.
*END STEP
*STEP,PERTURBATION
*STATIC
*DLOAD
1,CENTRIF,6.E7,0.,0.,0.,0.,1.,0.
*END STEP
*STEP,PERTURBATION
*STATIC
*DLOAD
1,GRAV,600.,0.,-1.,0.
*END STEP
*STEP,PERTURBATION
*STATIC
*DLOAD
1,HP1,3000.,7.,0.
*END STEP
*STEP,PERTURBATION
*STATIC
*DLOAD
1,HP2,3000.,7.,0.
*END STEP
*STEP,PERTURBATION
*STATIC
*DLOAD
1,HP3,3000.,7.,0.
*END STEP
*STEP,PERTURBATION
*STATIC
*DLOAD
1,HP4,3000.,7.,0.
*END STEP
*STEP,PERTURBATION
*STATIC
*DLOAD
1,P1,3000.
*END STEP
*STEP,PERTURBATION
*STATIC
*DLOAD
1,P2,3000.
*END STEP
*STEP,PERTURBATION
*STATIC
*DLOAD
1,P3,3000.
*END STEP
*STEP,PERTURBATION
*STATIC
*DLOAD
1,P4,3000.
*END STEP
*STEP,PERTURBATION
*STATIC
*TEMPERATURE
ALL,40.
*EL FILE
 S,
*OUTPUT,FIELD
*ELEMENT OUTPUT
S,
*NODE FILE
 RF,U
*OUTPUT,FIELD
*NODE OUTPUT
RF,U
*EL PRINT
 S,
*NODE PRINT
 RF,U
*END STEP
*STEP,PERTURBATION
*STATIC
*BOUNDARY,OP=NEW
LEFT,1
BOT,2
*TEMPERATURE,OP=MOD
ALL,40.
*END STEP