*HEADING
: EIGENVALUE ANALYSIS OF AN UNCONSTRAINED 1-ELEMENT MESH  [CPE4H]
*PREPRINT,ECHO=YES,HISTORY=NO,MODEL=NO
*NODE,NSET=NALL
*ELEMENT,TYPE=CPE4H, ELSET=EALL
*SOLID SECTION,MATERIAL=A1, ELSET=EALL
*MATERIAL,NAME=A1
*ELASTIC
 3.E6,.3
*DENSITY
7.5E-4,
*STEP
*FREQUENCY, eigensolver=lanczos
5, , ,-1.E7
*MODAL FILE
*OUTPUT,HISTORY,FREQUENCY=1
*MODAL OUTPUT
*END STEP