*HEADING
Cylindrical element testing (CCL24)
*PREPRINT, ECHO=YES, MODEL=YES, HISTORY=YES
**
**********************************************************
** Parameter definition
**
*PARAMETER
INRAD=1.5
EXRAD=2.0
HEIGHT=1.0
**
MIDHEIGHT=HEIGHT/2
MID=(INRAD+EXRAD)/2
**
***********************************************************
** Model definition
**
*NODE, NSET=SECTION
1, <INRAD>,0,0
2, <EXRAD>,0,0
3, <EXRAD>,0,<HEIGHT>
4, <INRAD>,0,<HEIGHT>
5,<MID>,0,0
6,<EXRAD>,0,<MIDHEIGHT>
7,<MID>,0,<HEIGHT>
8,<INRAD>,0,<MIDHEIGHT>
*NCOPY, CHANGE NUMBER=100, OLD SET=SECTION, NEW SET=REST, SHIFT, MULTIPLE=7
*NSET, NSET=ALL
REST,SECTION
**
*NSET, NSET=INT, GENERATE
*NSET, NSET=EX, GENERATE
*NSET, NSET=TOP, GENERATE
*NSET, NSET=BOTTOM, GENERATE
*NSET, NSET=AR1, GENERATE
*NSET, NSET=AR2, GENERATE
*NSET, NSET=AR3, GENERATE
*NSET, NSET=AR4, GENERATE
**
*ELEMENT, TYPE=CCL24, ELSET=LAST
*ELEMENT, TYPE=CCL24, ELSET=FIRST
*ELGEN, ELSET=FIRST3
*ELSET, ELSET=ALL
FIRST3,LAST
*SOLID SECTION, ELSET=ALL, MATERIAL=MYMAT
*MATERIAL, NAME=MYMAT
*ELASTIC
30E6,0.3
************************************************************
** Boundary Condition
*TRANSFORM, TYPE=C, NSET=ALL
*BOUNDARY
INT,1,3,0
ALL,2,2,0
*EQUATION
************************************************************
** History data
**
*STEP
*STATIC
*CLOAD
3,3,10e5
*OUTPUT, FIELD
*NODE OUTPUT, VARIABLE=PRESELECT
*ELEMENT OUTPUT,VARIABLE=PRESELECT
*END STEP