*HEADING
 eccrgfd2: FOUNDATION TYPES [CCL24]
*PREPRINT,MODEL=NO,HIST=NO
*NODE,NSET=ALL
*NSET,NSET=SYM
*NSET,NSET=BOT
*NSET,NSET=TOP
*NSET,NSET=OUTSIDE
*NSET,NSET=INSIDE
*NSET,NSET=MIDDLE
*ELEMENT,TYPE=CCL24, ELSET=EALL
*SOLID SECTION ,ELSET=EALL,MATERIA= A1,ORIENTA=CYL
*ORIENTATION,SYS=CYLIN,NAME=CYL
*TRANSFORM,TYPE=C,NSET=ALL
*MATERIAL,NAME=A1
*ELASTIC
 3.E6,0.3
*FOUNDATION
 1,F1,300.
*FOUNDATION
 1,F2,300.
*FOUNDATION
 1,F3,300.
*FOUNDATION
 1,F4,300.
*FOUNDATION
 1,F5,300.
*FOUNDATION
 1,F6,300.
*************************************
*STEP,PERTURBATION
 FOUNDATION F1
*STATIC
*BOUNDARY,OP=NEW
 INSIDE,1,1
 INSIDE,2,2,0.1
 OUTSIDE,2,2,0.4
 MIDDLE,2,2,0.25
 TOP,3
*EL PRINT,FREQ=1
 S
*NODE PRINT
 RF,
 U,
*OUTPUT,FIELD
*NODE OUTPUT,NSET=ALL
 RF, U
*ELEMENT OUTPUT
 S
*OUTPUT,HISTORY,FREQ=0
*END STEP
*************************************
*STEP,PERTURBATION
 FOUNDATION F3
*STATIC
*BOUNDARY,OP=NEW
 INSIDE, 1
 SYM, 2
 TOP, 3,3,0.1
 BOT, 3,3,0.1
*END STEP
*************************************
*STEP,PERTURBATION
 FOUNDATION F4
*STATIC
*BOUNDARY,OP=NEW
 OUTSIDE, 1, , 0.1
 INSIDE,  1, , 0.1
 SYM, 2
 TOP, 3
*END STEP