*HEADING
ECA6SLDI: *DSLAOD AND *TEMPERATURE FOR STRESS-DISPLACEMENT ELEMENTS  [CAX6MH]
*NODE,NSET=ALL
*NGEN,NSET=ALL
*ELEMENT,TYPE=CAX6MH,ELSET=ELEMS
*surface, NAME=SIDE_1
 1, S1
*surface, NAME=SIDE_2
 1, S2
*surface, NAME=SIDE_3
 2, S2
*surface, NAME=SIDE_4
 2, S3
*SOLID SECTION,MATERIAL=A1, ELSET=ELEMS
*MATERIAL,NAME=A1
*ELASTIC,TYPE=ISOTROPIC
 3.E6,0.3
*DENSITY
5.E-5,
*BOUNDARY
 ALL,1,2
*STEP,PERTURBATION
*STATIC
*DSLOAD
 SIDE_1,P,1000.
*ENERGY FILE
*NODE FILE
 RF,
*EL PRINT
 LOADS,
*EL FILE
 LOADS,
*NODE PRINT,TOTALS=YES
 RF,
*END STEP
*STEP,PERTURBATION
*STATIC
*DSLOAD
 SIDE_2,P,2000.
*END STEP
*STEP,PERTURBATION
*STATIC
*DSLOAD
 SIDE_3,P,3000.
*END STEP
*STEP,PERTURBATION
*STATIC
*DSLOAD
 SIDE_4,P,3000.
*END STEP
*STEP,PERTURBATION
*STATIC
*DSLOAD
 SIDE_1,HP,3000.,3.,0.
*END STEP
*STEP,PERTURBATION
*STATIC
*DSLOAD
 SIDE_2,HP,3000.,3.,0.
*END STEP
*STEP,PERTURBATION
*STATIC
*DSLOAD
 SIDE_3,HP,3000.,3.,0.
*END STEP
*STEP,PERTURBATION
*STATIC
*DSLOAD
 SIDE_4,HP,3000.,3.,0.
*END STEP