*HEADING
ECA4SHS3: PRESSURE AND HYDROSTATIC PRESSURE FOR AXISYM. SOLIDS  [CAX4H]
*PREPRINT,ECHO=YES,HISTORY=YES,MODEL=YES
*NODE
*ELEMENT,TYPE=CAX4H, ELSET=EALL
*SOLID SECTION,MATERIAL=A1, ELSET=EALL
*MATERIAL,NAME=A1
*ELASTIC,TYPE=ISOTROPIC
 30.0E6,0.3
*BOUNDARY
 1,2
 2,2
*STEP
*STATIC
*DLOAD,OP=NEW
 1, P3, 1000.0
 1, P2, 1000.0
 1, P4, 1000.0
*EL FILE
 S,
 COORD,
 E,
 LOADS,
*ENERGY FILE
*NODE FILE
 U,COORD
*NODE PRINT
 U,COORD
*EL PRINT
 S,
 COORD,
 E,
 LOADS,
*END STEP