*HEADING
PULSE LOADING, QUIET BOUND [CINAX4]
STEADY STATE DYNAMICS,DIRECT VERIFICATION
*NODE, NSET=NALL
*NSET,NSET=INTER1
*NSET,NSET=TOP
*NCOPY,OLD SET=INTER1,CHANGE NUMBER=3,POLE,NEW SET=FAR
*NSET,NSET=NALL,GENERATE
*ELEMENT,TYPE=CAX4,ELSET=FE
*SOLID SECTION,ELSET=FE,MATERIAL=ONE
*ELEMENT,TYPE=CINAX4,ELSET=IE
*SURFACE,NAME=SFIN,TYPE=ELEMENT
1, S1
*SURFACE,NAME=SINF,TYPE=ELEMENT
2, S1
*TIE, NAME=TIE
SFIN, SINF
*SOLID SECTION,ELSET=IE,MATERIAL=ONE
*MATERIAL,NAME=ONE
*ELASTIC
1.,.1
*DENSITY
.01,
*RESTART,WRITE,FREQUENCY=1
*STEP
*STEADYSTATEDYNAMICS,DIRECT,FREQUENCY SCALE=LINEAR
*BOUNDARY
NALL,1
TOP,2,2,1.E-4
*ENERGY PRINT
*EL PRINT,FREQUENCY=0
*NODE PRINT
U,
PU,
*OUTPUT,FIELD
*ENERGY OUTPUT
*NODE OUTPUT
U,
*OUTPUT,HISTORY
*ENERGY OUTPUT
*NODE OUTPUT, NSET=NALL
U,
*END STEP
*STEP
*STEADYSTATEDYNAMICS,DIRECT,FREQUENCY SCALE=LINEAR
*BOUNDARY,OP=NEW
NALL,2
TOP,1,1,1.E-4
*ENERGY PRINT
*EL PRINT,FREQUENCY=0
*NODE PRINT
U,
PU,
*OUTPUT,FIELD
*ENERGY OUTPUT
*NODE OUTPUT
U,
*OUTPUT,HISTORY
*ENERGY OUTPUT
*NODE OUTPUT, NSET=NALL
U,
*END STEP