*HEADING
 ECA3DVPJ: PATCH TEST FOR THERMAL/ELECTRICAL ELEMENTS  [DCAX3E]
*PREPRINT,ECHO=YES,HISTORY=NO,MODEL=NO
*NODE
*NGEN
*ELEMENT,TYPE=DCAX3E, ELSET=EALL
*NSET,NSET=SIDES,GENERATE
*SOLID SECTION,MATERIAL=A1, ELSET=EALL
*MATERIAL,NAME=A1
*ELECTRICAL CONDUCTIVITY
*JOULE HEAT FRACTION
*CONDUCTIVITY
4.85E-4,
*DENSITY
0.283,
*SPECIFIC HEAT
0.116,
*STEP
 STEADY STATE
*COUPLED THERMAL-ELECTRICAL,STEADY STATE
*BOUNDARY
10, 9, ,  0.0
20, 9, , 48.0
30, 9, , 60.0
40, 9, , 12.0
10,11, ,  0.0
20,11, , 48.0
30,11, , 60.0
40,11, , 12.0
*NODE PRINT, FREQUENCY=0
*EL PRINT
 HFL, ECD
*EL PRINT,POSITION=NODES
 HFL, ECD
*EL PRINT,POSITION=AVERAGED AT NODES
 HFL, ECD
*EL PRINT,POSITION=CENTROID
 HFL, ECD
*EL FILE
 HFL, ECD
*EL FILE,POSITION=NODES
 HFL, ECD
*EL FILE,POSITION=AVERAGED AT NODES
 HFL, ECD
*EL FILE,POSITION=CENTROID
 HFL, ECD
*ENDSTEP