*HEADING
ECA3GHDI: *DSLOAD AND *TEMPERATURE FOR STRESS-DISPLACEMENT ELEMENTS  [CGAX3H]
*NODE,NSET=ALL
*ELEMENT,TYPE=CGAX3H,ELSET=ELEMS
*surface, NAME=SIDE_1
 1, S1
*surface, NAME=SIDE_2
 1, S2
*surface, NAME=SIDE_3
 2, S2
*surface, NAME=SIDE_4
 2, S3
*SOLID SECTION,MATERIAL=A1, ELSET=ELEMS
*MATERIAL,NAME=A1
*ELASTIC,TYPE=ISOTROPIC
 3.E6,0.3
*DENSITY
5.E-5,
*BOUNDARY
 ALL,1,2
 ALL,5,5
*STEP,PERTURBATION
*STATIC
*OUTPUT,HISTORY,FREQUENCY=1
*ENERGY OUTPUT
*OUTPUT,FIELD
*NODE OUTPUT
 RF,
*DSLOAD
 SIDE_1,HP,3000.,3.,0.
*EL PRINT
 LOADS,
*OUTPUT,FIELD
*ELEMENT OUTPUT
 LOADS,
*NODE PRINT
 RF,
*END STEP
*STEP,PERTURBATION
*STATIC
*DSLOAD
 SIDE_2,HP,3000.,3.,0.
*END STEP
*STEP,PERTURBATION
*STATIC
*DSLOAD
 SIDE_3,HP,3000.,3.,0.
*END STEP
*STEP,PERTURBATION
*STATIC
*DSLOAD
 SIDE_4,HP,3000.,3.,0.
*END STEP
*STEP,PERTURBATION
*STATIC
*DSLOAD
 SIDE_1,P,1000.
*END STEP
*STEP,PERTURBATION
*STATIC
*DSLOAD
 SIDE_2,P,2000.
*END STEP
*STEP,PERTURBATION
*STATIC
*DSLOAD
 SIDE_3,P,3000.
*END STEP
*STEP,PERTURBATION
*STATIC
*DSLOAD
 SIDE_4,P,3000.
*END STEP