*HEADING
ECA3GFD1: DLOADS AND *TEMPERATURE FOR STRESS-DISPLACEMENT ELEMENTS  [CGAX3]
*PREPRINT,ECHO=YES,HISTORY=NO,MODEL=NO
*NODE,NSET=ALL
*ELEMENT,TYPE=CGAX3,ELSET=ELEMS
*SOLID SECTION,MATERIAL=A1, ELSET=ELEMS
*MATERIAL,NAME=A1
*ELASTIC,TYPE=ISOTROPIC
 3.E6,0.3
*DENSITY
5.E-5,
*BOUNDARY
 ALL,1,2
 ALL,5,5
*STEP,PERTURBATION
*STATIC
*OUTPUT,HISTORY,FREQUENCY=1
*ENERGY OUTPUT
*OUTPUT,FIELD
*NODE OUTPUT
 RF,
*DLOAD
 ELEMS,BR,1000.
*EL PRINT
 LOADS,
*OUTPUT,FIELD
*ELEMENT OUTPUT
 LOADS,
*NODE PRINT
 RF,
*END STEP
*STEP,PERTURBATION
*STATIC
*DLOAD
 ELEMS,BZ,2000.
*END STEP
*STEP,PERTURBATION
*STATIC
*DLOAD
 ELEMS,CENT,3000.,,,,0.,1.,0.
*END STEP
*STEP,PERTURBATION
*STATIC
*DLOAD
 ELEMS,CENTRIF,6.E7,,,,0.,1.,0.
*END STEP
*STEP,PERTURBATION
*STATIC
*DLOAD
 ELEMS,GRAV,400.,0.,-1.,0.
*END STEP
*STEP,PERTURBATION
*STATIC
*DLOAD
 1,HP1,3000.,3.,0.
*END STEP
*STEP,PERTURBATION
*STATIC
*DLOAD
 1,HP2,3000.,3.,0.
*END STEP
*STEP,PERTURBATION
*STATIC
*DLOAD
 2,HP2,3000.,3.,0.
*END STEP
*STEP,PERTURBATION
*STATIC
*DLOAD
 2,HP3,3000.,3.,0.
*END STEP
*STEP,PERTURBATION
*STATIC
*DLOAD
 1,P1,1000.
*END STEP
*STEP,PERTURBATION
*STATIC
*DLOAD
 1,P2,2000.
*END STEP
*STEP,PERTURBATION
*STATIC
*DLOAD
 2,P2,3000.
*END STEP
*STEP,PERTURBATION
*STATIC
*DLOAD
 2,P3,3000.
*END STEP