*HEADING
ECA3AFP7: PATCH TEST FOR ACCOUSTIC ELEMENTS [ACAX3]
*PREPRINT,ECHO=YES,HISTORY=NO,MODEL=NO
*NODE, Nset=ODB_NSET
*NGEN, Nset=ODB_NSET
*ELEMENT,TYPE=ACAX3, ELSET=EALL
*SOLID SECTION,ELSET=EALL,MATERIAL=A1
.12,
*MATERIAL,NAME=A1
*ACOUSTIC MEDIUM,BULK MODULUS
*DENSITY
1.0E+03,
*RESTART,WRITE
**
** Sets added by addodb
**
*Elset,Elset=ODB_ESET
EALL,
**
**
*Nset, Nset=ODB_NSET
ODB_NSET,
**
**
*STEP
 ATTEMPT 1 AT ACCOUSTIC PATCH TEST
*STEADY STATE DYNAMICS, DIRECT
.01,
*BOUNDARY
10,8, ,  0.0
20,8, , 48.0
30,8, , 60.0
40,8, , 12.0
*NODE PRINT, FREQ=2
 POR,
*OUTPUT,FIELD,FREQ=2
*NODE OUTPUT
 POR,
*OUTPUT,FIELD,FREQ=0
*ELEMENT OUTPUT
*EL PRINT, FREQ=2
*OUTPUT,FIELD,VARIABLE=PRESELECT,OP=ADD,FREQUENCY=9999
*OUTPUT,FIELD, OP=ADD,Frequency=2
*NODE OUTPUT
 POR,
*OUTPUT,HISTORY,OP=ADD,Frequency=2
*NODE OUTPUT, Nset=ODB_NSET
 POR,
*OUTPUT,FIELD, OP=ADD,Frequency=0
*ELEMENT OUTPUT
*OUTPUT,HISTORY,OP=ADD,Frequency=0
*ELEMENT OUTPUT, Elset=ODB_ESET
*ENDSTEP